program: Gaussian 09
title: 000032408
version: EM64L-G09RevD.01
frameworkgroup: C1[X(C16H17N)]
method: RPBEPBE
basis: SDD
operation: Freq
keyword: #pfreq=noraman
keyword: PBEPBE/SDD
title: #p freq=noraman PBEPBE/SDD
converged: YES YES NO NO
title: Mulliken charges:
elementType: N C C C C C C C C C C C C C C C C H H H H H H H H H H H H H H H H H
charge: -0.075945 -0.483181 0.065203 -0.423633 0.282928 -0.492899 0.233674 -0.394486 -0.623367 -0.414770 0.300367 -0.257315 -0.415583 -0.379371 -0.230943 -0.242847 -0.245109 0.224299 0.228804 0.217483 0.190859 0.186157 0.236053 0.232272 0.223208 0.186151 0.229351 0.250638 0.226128 0.248035 0.238424 0.224856 0.226048 0.228508
chargesum: 0.00000
title: Mulliken charges with hydrogens summed into heavy atoms:
elementType: N C C C C C C C C C C C C C C C C
charge: -0.075945 -0.030077 0.065203 -0.015290 0.282928 -0.070689 0.233674 -0.162214 0.015343 -0.164131 0.300367 -0.031187 -0.167549 -0.140947 -0.006087 -0.016798 -0.016601
polarizability: 2.39563122e+02 -1.80508303e+01 1.80089405e+02 8.94173001e+00 1.06343017e+01 1.10601377e+02
1716.lowfreq: -7.7001 0.0007 0.0007 0.0007 6.1176 9.7911 50.1919 62.5130 80.1838
frequency: 50.1784 62.4479 80.1828 87.3744 138.8099 199.5021 222.6361 234.0136 248.5451 278.6020 299.5607 323.4850 344.2005 404.1255 406.8007 419.5277 478.1367 505.1526 533.1642 575.0989 589.3915 615.5259 627.5046 673.1142 706.6161 727.7052 762.6431 786.3155 790.3891 795.6158 853.6321 869.5446 901.7430 922.0101 942.8644 970.5096 975.6272 988.2049 988.4671 992.2108 993.4690 1025.8273 1041.1820 1062.8140 1076.3246 1086.7122 1093.0806 1116.0139 1143.0217 1171.8528 1175.4111 1186.3946 1191.7906 1197.9626 1219.7842 1233.2255 1265.4610 1287.2259 1298.3052 1311.7306 1334.5200 1345.0831 1366.3512 1370.8432 1379.8197 1425.9507 1430.1998 1440.8608 1450.4818 1455.6641 1462.0487 1465.9281 1479.6566 1482.3642 1490.5291 1580.1301 1595.4404 1599.8895 1611.1185 2790.2854 2836.6315 2853.0441 2986.2320 2992.3744 3016.4061 3033.8789 3045.6669 3076.2490 3112.0456 3120.7085 3127.0127 3130.8989 3140.4570 3149.1388 3155.2944 3163.6770
redmass: 3.8682 3.2767 3.9626 3.0600 3.1795 2.8631 1.9003 2.0077 2.2707 2.9412 2.9767 2.6830 2.9449 3.6431 3.0449 3.6334 3.0101 3.7547 3.9851 3.6341 4.1975 5.9771 4.1671 5.0532 1.7089 2.5786 1.7723 2.7915 3.3048 1.8283 1.2438 3.3913 1.3584 1.4367 2.7185 1.3726 1.3931 3.3080 1.9826 2.0804 1.4850 2.5354 1.9365 2.2868 1.7425 1.7084 2.5003 1.3722 2.0345 1.0535 1.3778 1.1585 1.1511 2.0660 1.6410 1.6568 1.6674 1.8316 2.1137 1.5983 1.6026 1.5540 2.7023 4.2915 2.0361 2.1325 1.2059 1.2999 2.3125 1.3985 1.2417 1.2446 1.1123 1.0729 2.6465 5.7535 6.8832 6.5143 6.1132 1.0713 1.0673 1.0609 1.0613 1.0845 1.0719 1.0879 1.0997 1.1008 1.0875 1.0845 1.0875 1.0895 1.0924 1.0962 1.0990 1.1015
irintensity: 0.0767 0.5464 0.6694 0.2257 0.2362 1.6241 1.1645 1.7435 3.8474 2.1993 4.7325 3.7995 0.5532 0.5776 0.2820 1.0086 0.8713 4.6595 2.5161 4.4065 2.0503 0.5042 4.9328 0.9728 54.5800 8.8352 80.7294 1.8232 2.6228 25.9553 0.3920 5.6415 0.2301 2.9479 11.2466 0.0319 0.5245 2.8106 2.0953 4.9985 1.6104 8.3667 12.5228 2.9409 7.9686 1.4095 12.3619 11.7081 27.8232 0.0253 3.7136 2.3027 0.2596 0.2388 6.0564 8.8945 6.0083 1.7390 7.6190 2.1263 5.4056 6.3619 8.2393 0.7478 6.4534 12.7220 3.8851 7.3482 22.4402 22.5544 12.8568 4.9540 13.2885 9.4168 10.3068 2.7609 6.1137 1.9205 7.5350 70.5827 51.2249 228.5524 19.3444 28.2668 52.5146 43.1861 20.0184 31.6307 8.2170 4.9479 2.2742 18.9251 17.8576 39.4006 32.4823 21.4386
temp: 298.150 k
press: 1.00000 atm
elementType: 7 6 6 6 6 6 6 6 6 6 6 6 6 6 6 6 6 1 1 1 1 1 1 1 1 1 1 1 1 1 1 1 1 1
symmnumber: 1
zpe: 747939.1 jmol-1
zpe.correction: 0.284875 hartree
zpe.thermalcorrener: 0.299134 hartree
zpe.thermalcorrenthalpy: 0.300079 hartree
zpe.thermalcorrgfe: 0.243704 hartree
zpe.sumelectzpe: -673.433702 hartree
zpe.sumelectthermal: -673.419443 hartree
zpe.sumelectthermalent: -673.418498 hartree
zpe.sumelectthermalfe: -673.474873 hartree
dipole: -0.6309 -0.4293 0.8453
dipole: 1.1388
quadrupole: -88.4855 -93.9354 -103.3090
quadrupole: -1.6977 -0.0250 1.8171
quadrupole: 6.7578 1.3079 -8.0657 -1.6977 -0.0250 1.8171
hfenergy: -673.718577 hartree
pointgroup: C01 [X(C16H17N1)]
dipole: 0.2444636 0.2425227 0.2866183 debye
polarizability: 240.9003728|-16.9911136|171.5875166|-7.0257705|-23.161175|117.7660145 unknown
InChI: InChI=1S/C16H17N/c1-17-11-10-16-14(12-17)8-5-9-15(16)13-6-3-2-4-7-13/h2-9H,10-12H2,1H3
charge 0 multiplicity 1
34 atoms
N  3.235141 1.287042 -0.421693
C  0.790269 1.404469 -0.166901
C  0.747149 -0.111367 0.001311
C  2.140208 1.991683 0.279952
C  1.972762 -0.828114 0.078858
C  3.32427 -0.123044 0.004943
C  -0.489312 -0.823667 0.127815
C  1.967358 -2.230059 0.279248
C  4.535896 1.970347 -0.324097
C  -0.466331 -2.22703 0.340692
C  -1.824823 -0.14723 0.055426
C  0.753387 -2.93173 0.412391
C  -2.796718 -0.383948 1.066492
C  -2.182284 0.696214 -1.031751
C  -4.076775 0.209226 0.999967
C  -3.462978 1.286317 -1.10349
C  -4.416263 1.048863 -0.086075
H  0.649855 1.669118 -1.232596
H  -0.037706 1.876994 0.393548
H  2.187251 3.063646 0.013709
H  2.242579 1.918753 1.394645
H  3.812489 -0.208318 1.015504
H  3.982004 -0.66299 -0.704474
H  2.921666 -2.769425 0.33379
H  5.285035 1.433969 -0.935006
H  4.92886 2.0301 0.723914
H  4.448285 2.998534 -0.717553
H  -1.416325 -2.767187 0.421481
H  0.754298 -4.016874 0.562431
H  -2.534812 -1.022794 1.918044
H  -1.462736 0.867275 -1.839749
H  -4.806121 0.019137 1.795715
H  -3.718622 1.92516 -1.956556
H  -5.409254 1.50903 -0.140136
