program: Gaussian 09
title: 000032400
version: EM64L-G09RevD.01
frameworkgroup: C1[X(C15H15N)]
method: RPBEPBE
basis: SDD
operation: Freq
keyword: #pfreq=noraman
keyword: PBEPBE/SDD
title: #p freq=noraman PBEPBE/SDD
converged: YES YES NO NO
title: Mulliken charges:
elementType: N C C C C C C C C C C C C C C C H H H H H H H H H H H H H H H
charge: -0.314052 0.288056 -0.487007 0.275929 -0.530012 -0.434772 -0.565560 -0.402917 0.372718 -0.422902 0.325885 -0.398230 -0.396475 -0.236099 -0.237791 -0.243954 0.236010 0.206576 0.197078 0.232350 0.217141 0.190452 0.268746 0.238896 0.229925 0.238196 0.238050 0.238214 0.223808 0.223705 0.228037
chargesum: 0.00000
title: Mulliken charges with hydrogens summed into heavy atoms:
elementType: N C C C C C C C C C C C C C C C
charge: -0.045306 0.288056 -0.044421 0.275929 -0.100584 -0.027179 -0.326664 -0.172992 0.372718 -0.184706 0.325885 -0.160179 -0.158262 -0.012292 -0.014086 -0.015917
polarizability: 2.66186569e+02 7.35583489e+00 1.61332495e+02 -4.30281017e+00 5.63139267e+00 8.78204026e+01
1716.lowfreq: -7.9141 -5.9974 -4.5633 -0.0005 -0.0002 0.0006 49.9572 57.8267 93.1325
frequency: 49.9324 57.8208 93.1322 111.2684 150.5803 224.0752 253.5389 277.6046 303.7681 344.9629 404.4780 406.4238 424.1809 449.1031 478.6467 506.9724 556.5859 580.7012 600.2145 618.6408 683.8714 701.8883 708.9562 728.5696 740.6757 770.8890 830.4879 849.0333 856.9304 888.9591 899.4435 918.7831 932.8908 957.7490 972.2574 987.9006 991.8717 993.2260 1014.3641 1020.2386 1045.3229 1065.2539 1083.5966 1134.4638 1156.9560 1172.2501 1184.2089 1187.7756 1193.8505 1205.0340 1227.2993 1252.4474 1259.9676 1296.6785 1306.6161 1314.4441 1333.6127 1367.7154 1374.3696 1381.3886 1417.2834 1439.1651 1440.6469 1447.8268 1464.0008 1476.8201 1478.7351 1512.5950 1573.1206 1588.3464 1612.9521 1623.0953 2823.0263 2859.6422 2977.3401 3008.9510 3032.7738 3044.3757 3110.9413 3112.8014 3121.0611 3126.0387 3138.8994 3144.5591 3147.8054 3163.8121 3474.2244
redmass: 4.0996 3.4812 4.4679 2.7884 3.2608 3.2052 5.3277 3.3415 2.4570 3.0353 3.1813 3.0959 2.7537 3.6563 3.1906 3.5665 2.2138 3.5241 4.0347 5.7720 3.9948 1.7348 2.5936 3.1201 3.3080 1.8569 1.5894 1.2550 2.9535 1.3998 2.4998 1.5009 2.3994 1.3824 1.4214 4.6188 1.3667 1.7871 2.7640 2.6359 1.9921 2.0414 1.6062 2.0125 2.0888 1.0544 1.0837 1.6416 1.2022 1.4772 1.9184 1.2432 1.4721 1.8705 1.3683 1.6718 1.5697 2.8548 4.7375 1.9442 3.4592 1.5727 1.4825 1.3271 1.1386 1.2431 1.7735 3.0205 5.8795 6.7275 6.0707 6.6407 1.0715 1.0714 1.0597 1.0859 1.0995 1.0910 1.0903 1.0878 1.0843 1.0872 1.0922 1.0955 1.0961 1.1016 1.0755
irintensity: 0.5251 0.3992 0.2092 0.9479 0.6691 2.5758 0.0425 3.1581 2.8598 0.5459 5.8051 6.6819 22.1051 3.8397 11.6614 9.1000 64.2943 34.4244 2.2117 0.7021 19.4494 45.4546 13.4432 13.9679 29.7817 57.0382 13.7594 0.1784 6.0749 14.8963 0.6750 1.6290 15.9473 0.0096 0.4009 0.2309 0.4751 1.5857 5.6929 2.0095 4.6039 4.2555 8.2219 0.9609 16.2712 0.1321 2.1088 2.3332 0.9928 4.6440 1.3698 7.1180 1.2396 10.3927 6.7987 8.1841 4.0071 2.6633 0.5251 3.1853 11.5947 5.1644 9.9271 1.6200 10.0317 30.6111 28.8399 8.3349 8.7933 1.3379 14.4801 0.4371 86.0001 131.9511 31.6312 27.6579 32.4104 62.8681 22.6984 11.4042 5.2991 0.3194 18.7657 5.9228 51.7304 27.0759 0.7838
temp: 298.150 k
press: 1.00000 atm
elementType: 7 6 6 6 6 6 6 6 6 6 6 6 6 6 6 6 1 1 1 1 1 1 1 1 1 1 1 1 1 1 1
symmnumber: 1
zpe: 677359.8 jmol-1
zpe.correction: 0.257993 hartree
zpe.thermalcorrener: 0.270790 hartree
zpe.thermalcorrenthalpy: 0.271734 hartree
zpe.thermalcorrgfe: 0.218388 hartree
zpe.sumelectzpe: -634.219421 hartree
zpe.sumelectthermal: -634.206624 hartree
zpe.sumelectthermalent: -634.205680 hartree
zpe.sumelectthermalfe: -634.259026 hartree
dipole: 1.1551 -0.4428 1.0048
dipole: 1.5937
quadrupole: -79.3475 -83.4921 -100.2229
quadrupole: -1.2399 3.2881 0.3292
quadrupole: 8.3400 4.1954 -12.5354 -1.2399 3.2881 0.3292
hfenergy: -634.4774141 hartree
pointgroup: C01[X(C15H15N1)]
dipole: 0.4562404 0.3222281 -0.2848794 debye
polarizability: 266.2272534|-8.228351|144.9024499|2.7129447|30.9925776|104.2097628 unknown
InChI: InChI=1S/C15H15N/c1-2-4-12(5-3-1)14-7-6-13-8-9-16-11-15(13)10-14/h1-7,10,16H,8-9,11H2
charge 0 multiplicity 1
31 atoms
N  4.106344 1.214012 0.659987
C  2.291246 -0.790743 -0.162095
C  3.790552 -1.061355 -0.187723
C  1.785772 0.50215 0.143235
C  2.730374 1.674688 0.396695
C  4.597508 0.243793 -0.340201
C  0.389461 0.721238 0.167216
C  1.365018 -1.829793 -0.433836
C  -0.541521 -0.315629 -0.097981
C  -0.023621 -1.605616 -0.402306
C  -2.010771 -0.06419 -0.05788
C  -2.895609 -0.747135 -0.938636
C  -2.571565 0.866773 0.860712
C  -4.286125 -0.509473 -0.902637
C  -3.96132 1.108297 0.896396
C  -4.827927 0.420848 0.014844
H  4.089612 -1.545567 0.762583
H  4.037435 -1.763494 -1.007753
H  2.664681 2.359973 -0.489631
H  2.375713 2.251929 1.271879
H  5.669696 0.052625 -0.154477
H  4.49776 0.61864 -1.39053
H  4.756316 1.990707 0.826255
H  0.017804 1.733776 0.372089
H  1.745089 -2.833069 -0.664794
H  -0.712007 -2.438412 -0.585004
H  -2.487094 -1.447335 -1.676217
H  -1.916223 1.382066 1.57225
H  -4.946005 -1.042215 -1.596888
H  -4.369803 1.824168 1.618836
H  -5.907391 0.606542 0.042711
