program: Gaussian 09
title: 000032334
version: EM64L-G09RevD.01
frameworkgroup: C1[X(C11H11NO3S)]
method: RPBEPBE
basis: SDD
operation: Freq
keyword: #p
keyword: freq=noraman
keyword: PBEPBE/SDD
title: #p freq=noraman PBEPBE/SDD
converged: YES YES NO NO
title: Mulliken charges:
elementType: S O O O N C C C C C C C C C C C H H H H H H H H H H H
charge: 0.260275 -0.440499 -0.408383 -0.214255 -0.628676 -0.596559 0.562447 0.479122 -0.117974 -0.447607 -0.772891 -0.527792 -0.235417 0.302160 0.155712 -0.413483 0.266399 0.218367 0.255254 0.281779 0.254491 0.242567 0.291391 0.279924 0.222138 0.354746 0.376764
chargesum: 0.00000
title: Mulliken charges with hydrogens summed into heavy atoms:
elementType: S O O O N C C C C C C C C C C C
charge: 0.260275 -0.085753 -0.031619 -0.214255 -0.057362 -0.111794 0.562447 0.479122 0.137279 -0.447607 -0.491112 -0.273301 0.007151 0.302160 0.155712 -0.191345
polarizability: 1.83453604e+02 -1.51569063e+01 1.71283979e+02 2.62229511e+01 3.97554806e+00 9.24883634e+01
1716.lowfreq: -92.2540 -7.6043 -5.4218 -0.0016 -0.0015 0.0013 5.0206 27.1204 38.9871
frequency: -92.2405 27.0020 38.9633 58.4214 76.8117 114.3466 146.7981 206.2471 229.8064 272.2358 289.9487 307.4321 325.2243 337.3508 343.1033 375.9959 387.7598 426.8059 453.1762 485.7050 512.8298 528.8676 589.5601 601.5424 619.9886 631.9388 659.7749 715.8753 717.5436 740.7445 772.6663 783.6362 792.4255 803.4770 869.5701 902.7556 923.8450 929.9957 993.3227 1019.0623 1039.1945 1082.1038 1132.7741 1139.7943 1150.0449 1159.8253 1166.6839 1184.5732 1224.1543 1249.8375 1260.5497 1282.0647 1322.7299 1346.6276 1393.7115 1397.6016 1448.0817 1462.3740 1470.1419 1542.4366 1578.8282 1626.1226 1629.7635 1674.3539 2935.2789 2980.0057 3073.4644 3122.2137 3156.9790 3161.4397 3218.0390 3505.3511 3508.2787 3588.5750 3643.3829
redmass: 1.4885 6.6815 5.5714 4.9206 2.9452 6.3579 6.0499 4.3994 3.6524 3.5746 4.5479 4.4219 1.1364 4.9489 3.7990 8.1537 1.4807 3.1249 4.5362 4.1183 3.6641 6.1303 4.8965 1.4938 3.5172 4.5596 3.4466 4.7072 5.2374 3.8529 2.5786 1.6264 1.7877 2.5735 1.6441 4.1622 1.3445 2.2654 2.4683 5.2023 3.0849 2.5148 2.8304 1.4331 1.3425 1.2074 1.4244 1.3438 2.1116 1.6392 1.5311 1.2906 1.2819 2.8832 3.6028 2.1983 3.5866 1.1044 3.8989 6.2999 7.6826 6.0671 1.2425 4.7591 1.0831 1.0656 1.0963 1.0889 1.0950 1.0927 1.0958 1.0637 1.0447 1.0661 1.1007
irintensity: 23.5907 0.6618 2.4375 3.2075 19.0054 0.0425 3.0942 1.8043 3.3370 19.8809 4.0793 2.4069 133.3831 1.5094 5.0548 8.9607 195.8433 2.1212 43.6352 4.9153 2.3313 0.2334 16.4275 116.6443 31.4909 8.3490 32.8730 10.2883 17.4374 2.9419 5.2937 73.1979 7.4005 20.4469 29.7285 56.5677 0.4967 1.1886 12.5473 1.7531 240.2092 13.0461 27.8992 184.5344 6.9018 27.8658 7.0299 19.5831 8.2067 5.4245 41.5033 8.2215 7.7441 29.9596 28.7524 16.5297 41.2720 17.3768 5.4959 12.0774 30.9574 50.7553 81.2212 177.7339 49.6002 27.1182 9.0111 12.2077 13.1303 2.7973 1.4731 19.7846 6.7787 43.0258 6.7172
temp: 298.150 k
press: 1.00000 atm
elementType: 16 8 8 8 7 6 6 6 6 6 6 6 6 6 6 6 1 1 1 1 1 1 1 1 1 1 1
symmnumber: 1
zpe: 525578.9 jmol-1
zpe.correction: 0.200182 hartree
zpe.thermalcorrener: 0.215034 hartree
zpe.thermalcorrenthalpy: 0.215978 hartree
zpe.thermalcorrgfe: 0.157049 hartree
zpe.sumelectzpe: -1103.086364 hartree
zpe.sumelectthermal: -1103.071512 hartree
zpe.sumelectthermalent: -1103.070568 hartree
zpe.sumelectthermalfe: -1103.129497 hartree
dipole: 2.6108 -1.5843 1.1944
dipole: 3.2791
quadrupole: -94.0089 -94.6613 -98.6538
quadrupole: 2.1163 2.1997 2.5931
quadrupole: 1.7658 1.1134 -2.8792 2.1163 2.1997 2.5931
hfenergy: -1103.286546 hartree
pointgroup: C01 [X(C11H11N1O3S1)]
dipole: -1.0683878 0.4551916 0.5618649 debye
polarizability: 184.8620191|-10.0178965|168.8789465|-29.5140769|4.3300867|93.484981 unknown
InChI: InChI=1S/C11H11NO3S/c12-9(11(14)15)3-6-5-16-10-2-1-7(13)4-8(6)10/h1-2,4-5,9,13-14H,3,12H2
charge 0 multiplicity 1
27 atoms
S  -0.72898 -2.910515 -0.536784
O  -3.331227 2.379214 0.620249
O  2.223141 -0.301208 1.920587
O  4.016778 -0.406378 0.449997
N  3.073513 2.230662 -0.434375
C  1.460099 0.544135 -1.216271
C  0.434734 -0.516599 -0.888204
C  -0.901029 -0.230201 -0.369468
C  2.150433 1.195955 0.035057
C  -1.667974 -1.413007 -0.119631
C  0.66202 -1.87002 -1.03032
C  -1.486954 1.035496 -0.111072
C  -2.982423 -1.35297 0.379221
C  -2.801296 1.094976 0.385089
C  2.926625 0.106017 0.779122
C  -3.552222 -0.088883 0.634785
H  2.268759 0.141852 -1.850015
H  0.980745 1.368951 -1.781782
H  1.359836 1.553362 0.7312
H  1.564988 -2.357586 -1.397357
H  -0.944854 1.968285 -0.292297
H  -3.560816 -2.262671 0.568101
H  3.797258 2.538698 0.215418
H  2.650718 2.978572 -0.985364
H  -4.576058 -0.021501 1.024114
H  -4.254734 2.320815 0.968922
H  2.69892 -1.066851 2.34508
