program: Gaussian 09
title: 000032417
version: EM64L-G09RevD.01
frameworkgroup: C1[X(C12H7Cl6N3S)]
method: RPBEPBE
basis: SDD
operation: Freq
keyword: #p
keyword: freq=noraman
keyword: PBEPBE/SDD
title: #p freq=noraman PBEPBE/SDD
converged: YES YES NO NO
title: Mulliken charges:
elementType: Cl Cl Cl Cl Cl Cl S N N N C C C C C C C C C C C C H H H H H H H
charge: 0.119999 0.151522 0.123748 0.130290 0.100580 0.159610 0.341687 0.135174 0.073311 0.072342 0.490193 -0.324754 -0.371104 -0.218327 -0.382999 0.284217 0.243896 -0.819448 -0.229150 -0.215193 -0.783171 -0.784909 0.258126 0.238124 0.240770 0.263710 0.230226 0.237830 0.233699
chargesum: 0.00000
title: Mulliken charges with hydrogens summed into heavy atoms:
elementType: Cl Cl Cl Cl Cl Cl S N N N C C C C C C C C C C C C
charge: 0.119999 0.151522 0.123748 0.130290 0.100580 0.159610 0.341687 0.135174 0.073311 0.072342 0.490193 -0.324754 -0.371104 0.039799 -0.144875 0.284217 0.243896 -0.084742 0.008680 0.018506 -0.783171 -0.784909
polarizability: 3.02423541e+02 6.18293897e+00 2.05927336e+02 8.84312937e+00 9.04764627e+00 1.86275404e+02
1716.lowfreq: -0.0025 -0.0016 0.0016 2.0738 4.9667 7.0863 10.7209 12.1945 23.3395
frequency: 10.2792 12.1724 23.2605 31.9685 51.1782 68.3373 80.5976 96.4129 101.3060 132.3614 145.5543 153.5254 157.6286 170.8428 210.0440 216.2167 221.6574 247.4714 251.7229 252.4748 278.5454 286.6133 303.0797 317.3894 357.7611 375.2823 391.9378 419.2737 440.5059 450.1875 488.0410 531.9728 545.2509 604.8119 617.3658 652.4453 660.9025 699.1690 710.2508 715.2382 760.2942 762.8726 772.4654 779.5125 796.5884 842.3652 872.9495 899.4246 909.3353 953.5017 986.1145 989.5612 994.2418 1019.4940 1044.8182 1047.9331 1131.3117 1172.9148 1175.9692 1213.5581 1219.0911 1275.8405 1279.3972 1330.8236 1369.8233 1397.3042 1421.9054 1424.1853 1454.3593 1463.5369 1467.4676 1479.0995 1577.7740 1603.9412 2981.3555 3063.5513 3093.3972 3129.1517 3142.3507 3153.8637 3170.9922
redmass: 29.3571 24.9157 7.1303 6.2243 4.8527 14.6783 24.9595 17.9026 9.6197 1.0806 10.6036 3.8055 26.4497 32.9970 12.9602 12.5671 20.1867 5.8841 8.9294 6.8004 24.1423 16.6543 22.1811 15.5101 5.6191 23.6518 13.4781 4.5880 6.3430 5.3937 5.0884 5.4905 5.5930 13.4363 13.0118 10.9769 7.2803 11.5014 9.5264 3.6488 3.2636 1.7871 12.0560 10.9531 4.8009 12.6275 1.2905 13.9601 12.7273 1.3706 1.6676 9.6859 1.3382 5.1256 2.1777 1.5650 1.5149 12.4868 1.0590 10.2013 2.4554 12.1629 1.4611 11.9828 7.9363 1.2298 2.1020 10.7786 6.5380 1.5728 1.5243 1.1508 5.8009 6.7447 1.0377 1.0959 1.0996 1.0866 1.0892 1.0947 1.1009
irintensity: 0.1187 0.0009 0.0856 0.2024 0.4280 0.1431 0.0122 0.0610 0.3352 0.8152 0.3837 0.7001 0.3408 0.2842 0.3708 0.4606 0.2571 0.1495 2.3117 2.1064 0.1638 0.4971 0.8084 1.9209 1.0184 0.1808 0.5559 4.8613 2.2800 1.8890 8.6237 8.3156 5.2551 9.3454 97.2822 66.5116 42.2405 190.4005 158.5247 25.1675 136.8252 17.4098 0.7150 45.8556 0.8014 5.1899 0.3383 13.3496 3.3662 0.5700 1.1214 48.2020 0.0789 42.7572 2.8015 9.2311 5.9559 4.3862 2.2734 315.3074 2.9463 6.9527 3.0426 22.5018 2.9181 15.0310 14.3421 244.1211 553.5383 19.5017 20.6995 14.4380 0.1025 2.0818 13.7275 10.5741 17.2720 3.1528 6.5722 18.4678 21.7926
temp: 298.150 k
press: 1.00000 atm
elementType: 17 17 17 17 17 17 16 7 7 7 6 6 6 6 6 6 6 6 6 6 6 6 1 1 1 1 1 1 1
symmnumber: 1
zpe: 437267.8 jmol-1
zpe.correction: 0.166547 hartree
zpe.thermalcorrener: 0.189284 hartree
zpe.thermalcorrenthalpy: 0.190228 hartree
zpe.thermalcorrgfe: 0.109104 hartree
zpe.sumelectzpe: -3782.520460 hartree
zpe.sumelectthermal: -3782.497723 hartree
zpe.sumelectthermalent: -3782.496779 hartree
zpe.sumelectthermalfe: -3782.577902 hartree
dipole: -4.0406 -0.6773 0.0770
dipole: 4.0977
quadrupole: -165.7176 -183.3162 -166.6842
quadrupole: 1.9447 0.7652 2.1994
quadrupole: 6.1884 -11.4102 5.2218 1.9447 0.7652 2.1994
hfenergy: -3782.6870068 hartree
pointgroup: C01 [X(C12H7Cl6N3S1)]
dipole: -1.6054694 0.1252709 0.0760137 debye
polarizability: 301.6101348|5.2101333|201.1845469|-14.2850845|11.3025446|191.8315997 unknown
InChI: InChI=1S/C12H7Cl6N3S/c1-6-4-2-3-5-7(6)22-10-20-8(11(13,14)15)19-9(21-10)12(16,17)18/h2-5H,1H3
charge 0 multiplicity 1
29 atoms
Cl 4.666394 0.74998 -1.680134
Cl 4.110731 2.890399 0.372201
Cl 4.858363 0.114484 1.283644
Cl -0.542913 -3.194682 0.686613
Cl -0.204123 -2.57727 -2.267353
Cl 2.1247 -3.616381 -0.645808
S  -1.070448 2.265117 0.483697
N  -0.093894 -0.256817 -0.07422
N  1.500175 1.545047 0.211022
N  2.275176 -0.698352 -0.259405
C  -3.186106 0.774754 -0.741407
C  -2.617264 1.240436 0.474276
C  0.216322 1.043724 0.174696
C  -3.237651 1.032206 1.725572
C  -4.415539 0.071551 -0.64421
C  0.974654 -1.07679 -0.279821
C  2.471623 0.637937 -0.010984
C  -2.52268 0.976721 -2.087294
C  -4.462314 0.331901 1.790102
C  -5.048325 -0.150673 0.598593
C  3.934232 1.098251 0.00015
C  0.637631 -2.541556 -0.590176
H  -2.764902 1.410734 2.637293
H  -4.877376 -0.305247 -1.564063
H  -2.12852 2.00199 -2.202752
H  -1.671494 0.278756 -2.201575
H  -3.229628 0.780073 -2.910503
H  -4.946493 0.165697 2.75785
H  -5.99753 -0.696391 0.635894
