program: Gaussian 09
title: 000003428
version: EM64L-G09RevD.01
frameworkgroup: C1[X(C12H31N7)]
method: RPBEPBE
basis: SDD
operation: Freq
keyword: #pfreq=noraman
keyword: PBEPBE/SDD
title: #p freq=noraman PBEPBE/SDD
converged: YES YES NO NO
title: Mulliken charges:
elementType: N N N N N N N C C C C C C C C C C C C H H H H H H H H H H H H H H H H H H H H H H H H H H H H H H H
charge: -0.300459 -0.625396 -0.306121 -0.118929 -0.572647 -0.655797 -0.641188 -0.080627 -0.353290 -0.403483 -0.351451 -0.401864 -0.421704 -0.356697 -0.458344 -0.384328 -0.383501 -0.374805 0.224017 0.175347 0.241005 0.165590 0.167321 0.235004 0.181680 0.232479 0.219154 0.212209 0.186111 0.184088 0.230493 0.175133 0.244032 0.257505 0.261009 0.211229 0.163403 0.227467 0.158574 0.275607 0.202762 0.178748 0.227805 0.185914 0.265931 0.250718 0.329801 0.307101 0.324920 0.288474
chargesum: 0.00000
title: Mulliken charges with hydrogens summed into heavy atoms:
elementType: N N N N N N N C C C C C C C C C C C C
charge: -0.069965 -0.106882 -0.078654 -0.118929 -0.055999 -0.018896 -0.027794 0.094721 0.053306 -0.001157 0.062708 0.029498 -0.051506 0.062467 -0.083712 0.049854 -0.001990 0.038914 0.224017
polarizability: 1.94587125e+02 -9.60263467e+00 1.86360790e+02 1.31810883e+01 4.69379778e+00 1.75758922e+02
1716.lowfreq: -14.0809 -6.3665 -0.0009 -0.0004 -0.0004 4.7806 10.3748 22.1506 23.8706
frequency: 6.9610 21.4934 23.4762 29.4384 37.2609 52.5912 56.7274 62.3610 76.0802 92.2393 138.7808 152.8419 175.5506 179.6261 186.4596 188.5264 199.0924 219.0163 231.4296 246.6677 262.4190 270.7346 286.0697 303.7894 336.1613 355.5787 371.5886 402.6156 425.9199 432.1084 436.7881 452.4427 480.1125 529.4831 533.5592 545.4839 568.0842 582.6894 624.5589 643.1906 662.8514 673.7109 684.2203 753.7423 789.0153 805.1090 819.9930 858.6470 860.1958 875.5171 894.3887 903.6958 946.3448 952.4719 969.8685 993.4584 1002.7542 1017.5629 1022.3155 1036.6753 1048.6671 1051.9983 1070.0878 1076.3719 1089.2699 1092.2879 1120.8137 1123.5395 1138.0430 1155.1687 1161.6509 1170.3804 1179.2599 1184.8140 1191.7927 1217.3453 1244.0142 1253.3398 1257.1850 1272.7218 1280.6344 1288.1896 1290.4076 1294.8431 1318.7695 1326.5028 1333.1661 1347.1507 1349.6652 1350.6565 1363.7193 1377.2690 1377.7480 1388.5168 1393.6235 1402.9828 1436.4587 1445.5472 1450.4111 1453.7298 1461.7521 1463.9227 1468.6059 1474.1746 1483.3589 1489.1609 1492.7037 1509.1751 1601.5544 1615.0068 1630.7033 1635.1711 1668.3255 2810.4312 2815.9401 2823.4190 2849.3321 2849.6303 2863.9214 2872.4019 2932.6320 2941.6084 2963.7882 2966.1841 2989.3174 2992.5979 3010.9329 3019.4951 3031.1355 3036.0538 3042.0809 3046.9739 3051.1250 3063.7348 3404.4605 3431.3010 3439.9412 3440.0051 3514.8730 3544.9704 3566.5942 3568.5414 3661.5804 3691.0210
redmass: 4.3293 3.0942 4.5658 4.4378 4.3342 3.2240 2.8417 3.2741 3.0161 2.9209 3.1246 2.6114 2.8657 2.5094 2.6022 2.7931 2.4464 2.5812 1.2379 1.2441 2.1660 2.0064 2.1423 2.3972 2.8383 2.3514 1.3145 1.3004 1.9551 1.2097 2.1148 2.2926 2.4494 2.6871 2.7373 2.6494 1.3985 1.6675 1.2940 1.3431 1.8046 4.4741 1.3541 1.3959 1.1826 2.7249 1.5615 2.6185 1.9646 2.4806 1.9600 1.5127 1.6380 2.3054 1.9153 1.6801 2.0031 2.0047 1.8545 1.4397 1.9524 2.1362 2.0346 2.4367 1.9619 2.3799 1.8948 1.9722 1.7345 2.5154 2.1491 1.5426 1.5823 1.8617 1.3464 1.3251 1.3023 1.3763 1.3733 1.2092 1.1224 1.2055 1.1442 1.2818 1.2460 1.3369 1.2959 1.3633 1.4332 1.4110 1.5623 1.4444 1.4667 1.5196 1.4097 4.1437 1.1807 1.2162 1.0769 1.0908 1.1018 1.1007 1.1349 1.0808 1.0798 1.0866 1.0839 1.0781 1.2252 1.2939 1.1000 1.0944 3.4246 1.0786 1.0704 1.0745 1.0691 1.0666 1.0712 1.0718 1.0904 1.0699 1.0605 1.0609 1.0903 1.0615 1.0964 1.0959 1.0879 1.0919 1.0916 1.0880 1.0924 1.0979 1.0738 1.0737 1.0447 1.0447 1.0449 1.0454 1.0969 1.0971 1.1017 1.1024
irintensity: 0.1035 0.2792 0.1707 1.1220 4.1087 0.2291 1.9417 0.1999 3.2433 0.6596 2.1087 4.2170 0.8863 4.2035 6.3379 5.8287 4.2652 8.7212 35.5685 41.5087 3.8412 3.8971 16.0500 1.5801 18.1711 14.5184 55.1382 116.9535 4.0122 173.5089 40.2702 28.4139 13.3950 7.2781 38.5977 58.0213 67.9974 215.7564 235.6921 118.1511 29.1649 112.7097 67.2587 2.4966 7.4222 1.0744 9.1727 6.6404 4.3505 0.1868 1.7732 1.6584 3.0014 14.3693 0.2855 1.6682 8.6917 16.5551 7.6208 6.6912 12.3792 14.0491 4.8368 9.2550 3.8480 2.0406 18.6755 22.9938 11.5450 74.9926 57.0829 1.0601 8.6917 2.9910 11.8335 10.4823 5.0823 10.9319 2.0134 1.0815 1.5398 13.0492 4.1215 12.5992 8.4927 1.3636 7.4327 33.9431 3.1067 12.3641 3.0609 2.5036 6.1586 6.2539 0.1867 128.3622 30.5493 15.1108 1.7965 23.0465 2.9875 16.4826 1.6983 15.2766 9.6266 14.6969 1.0858 5.2284 126.9442 76.4268 73.2498 34.3799 503.4164 133.7319 118.2153 140.7709 195.2030 81.6070 155.2742 142.4800 46.5697 69.8947 63.3819 78.4327 14.2211 44.9445 25.5896 22.9174 22.7779 37.4054 16.3848 30.0015 49.2753 45.0521 5.1886 1.8674 4.1017 3.6033 15.4760 17.2827 0.0358 0.2947 21.1822 18.1665
temp: 298.150 k
press: 1.00000 atm
elementType: 7 7 7 7 7 7 7 6 6 6 6 6 6 6 6 6 6 6 6 1 1 1 1 1 1 1 1 1 1 1 1 1 1 1 1 1 1 1 1 1 1 1 1 1 1 1 1 1 1 1
symmnumber: 1
zpe: 1174379.5 jmol-1
zpe.correction: 0.447298 hartree
zpe.thermalcorrener: 0.472003 hartree
zpe.thermalcorrenthalpy: 0.472947 hartree
zpe.thermalcorrgfe: 0.388946 hartree
zpe.sumelectzpe: -857.496183 hartree
zpe.sumelectthermal: -857.471478 hartree
zpe.sumelectthermalent: -857.470534 hartree
zpe.sumelectthermalfe: -857.554534 hartree
dipole: -0.3687 3.8216 -1.4836
dipole: 4.1160
quadrupole: -102.9067 -106.8111 -115.3370
quadrupole: -11.7695 4.1620 4.4918
quadrupole: 5.4449 1.5405 -6.9854 -11.7695 4.1620 4.4918
hfenergy: -857.9434803 hartree
pointgroup: C01 [X(C12H31N7)]
dipole: -0.1478072 1.3255645 -0.9183499 debye
polarizability: 193.9311235|-6.2206|187.6070657|15.598091|1.9898779|175.1686483 unknown
InChI: InChI=1S/C12H31N7/c13-5-2-6-17-7-3-8-18-10-11(14)4-1-9-19-12(15)16/h11,17-18H,1-10,13-16H2
charge 0 multiplicity 1
50 atoms
N  2.708607 -1.100445 -0.433763
N  3.75134 2.133243 1.187688
N  -0.775376 -2.665413 -0.297004
N  -1.230615 1.738761 -0.705708
N  -2.82967 -1.725704 3.464141
N  -2.560843 3.585831 -1.572645
N  -2.574822 1.484824 -2.618708
C  3.172866 1.283218 0.121096
C  1.792783 1.830292 -0.317838
C  3.110037 -0.175273 0.639242
C  2.286143 -2.456666 -0.026975
C  0.732051 1.921778 0.798469
C  1.50931 -3.153292 -1.165854
C  0.150831 -2.470385 -1.433864
C  -0.56971 2.590047 0.306784
C  -1.977918 -1.8005 -0.308829
C  -2.796381 -1.962141 0.989147
C  -2.018734 -1.515293 2.243733
C  -2.07385 2.265893 -1.561102
H  3.813841 1.268263 -0.801414
H  1.408303 1.180076 -1.124131
H  1.942783 2.841946 -0.758046
H  4.102652 -0.430532 1.097976
H  2.367006 -0.237652 1.453816
H  3.138332 -3.103456 0.300023
H  1.597819 -2.353878 0.832658
H  0.474301 0.907669 1.158108
H  1.141879 2.485865 1.658325
H  1.351342 -4.219578 -0.900878
H  2.115165 -3.144145 -2.096074
H  3.39172 -1.121601 -1.20346
H  -0.268056 -2.83788 -2.405544
H  0.330587 -1.384019 -1.538236
H  4.658354 1.805126 1.537389
H  3.769976 3.131323 0.953128
H  -1.245122 2.735108 1.180368
H  -0.320559 3.609507 -0.085411
H  -1.02872 -3.658527 -0.181117
H  -2.647654 -2.010517 -1.185224
H  -1.638786 -0.749429 -0.401946
H  -3.110969 -3.016417 1.129398
H  -3.726072 -1.361993 0.895645
H  -1.101943 -2.126294 2.319081
H  -1.688749 -0.457652 2.09191
H  -2.305745 -1.617443 4.338709
H  -3.697027 -1.177198 3.477626
H  -2.322274 4.205936 -0.803867
H  -2.866726 4.006757 -2.447595
H  -2.201611 0.536451 -2.656382
H  -3.542893 1.616308 -2.910943
