program: Gaussian 09
title: 000032423
version: EM64L-G09RevD.01
frameworkgroup: C1[X(C13H9Cl6N3OS)]
method: RPBEPBE
basis: SDD
operation: Freq
keyword: #p
keyword: freq=noraman
keyword: PBEPBE/SDD
title: #p freq=noraman PBEPBE/SDD
converged: YES YES NO NO
title: Mulliken charges:
elementType: Cl Cl Cl Cl Cl Cl S O N N N C C C C C C C C C C C C C H H H H H H H H H
charge: 0.122734 0.149194 0.119469 0.115787 0.146946 0.125390 0.354217 -0.261568 0.113828 0.071185 0.096051 -0.229839 0.353434 -0.198599 -0.168002 -0.336448 -0.352846 -0.398812 0.285154 0.267668 -0.249728 -0.779310 -0.784707 -0.681581 0.251316 0.252789 0.252745 0.258520 0.213958 0.211657 0.210808 0.233740 0.234851
chargesum: 0.00000
title: Mulliken charges with hydrogens summed into heavy atoms:
elementType: Cl Cl Cl Cl Cl Cl S O N N N C C C C C C C C C C C C C
charge: 0.122734 0.149194 0.119469 0.115787 0.146946 0.125390 0.354217 -0.261568 0.113828 0.071185 0.096051 -0.229839 0.353434 0.052716 0.084787 -0.083703 -0.094326 -0.398812 0.285154 0.267668 0.175887 -0.779310 -0.784707 -0.002182
polarizability: 3.52633590e+02 3.46958314e+00 2.20964675e+02 4.01114645e+00 -8.21369144e-01 1.92237607e+02
1716.lowfreq: -5.3429 -4.7868 -3.1372 -1.5304 -0.0007 -0.0004 0.0014 8.3779 13.3317
frequency: -2.5470 7.4419 13.1061 15.6658 21.1369 54.0494 58.6419 78.0377 95.7762 101.2712 116.7086 121.9732 144.7213 151.4953 153.6518 178.6214 204.1242 211.3560 223.9745 245.3846 250.3628 264.7167 273.3376 276.7438 295.5233 304.4529 308.7366 350.3220 375.7551 388.4222 405.3469 413.7316 435.1479 461.7510 491.8103 531.9590 605.0497 621.1897 622.7822 638.4586 654.7824 692.2416 713.2217 715.0270 766.5441 769.0746 772.4943 774.0137 806.3538 830.2577 836.2138 843.6513 898.6937 900.5690 904.2573 944.2932 964.8233 989.8908 991.1750 1033.1451 1074.5000 1111.1526 1118.0686 1135.0323 1165.6982 1175.5622 1214.4950 1229.5642 1262.6475 1282.3772 1291.7185 1324.8306 1361.5210 1373.2991 1401.2550 1412.6823 1421.2363 1451.3113 1461.7734 1471.7510 1480.0423 1490.3423 1577.1031 1604.9194 2960.0577 2998.9385 3020.4036 3096.2487 3108.6104 3149.8187 3153.0912 3172.1797 3176.8749
redmass: 28.6650 17.4312 4.7145 7.5687 4.9979 4.9448 17.6286 24.8585 9.8238 19.7368 1.8351 4.9098 7.0712 8.2878 20.9552 32.7167 19.7522 16.3497 23.6763 1.2174 23.4029 5.8860 10.7691 19.4686 12.9842 21.4069 9.3127 8.0478 26.8385 8.3946 6.7596 2.9689 11.7038 7.3676 5.2979 3.6520 13.5013 6.7381 13.0095 6.7533 12.6191 12.5594 3.6517 11.9169 12.2653 12.1365 8.7308 5.5417 1.2652 1.1778 1.4774 12.4175 11.0950 3.7573 11.3130 1.3481 1.3570 4.1454 11.1410 2.7381 2.6792 1.5058 1.8384 1.4366 12.6737 1.2366 10.0929 3.4878 1.1422 12.1865 1.2671 11.9719 1.8200 2.3618 1.2717 4.2470 12.8779 10.1598 1.0395 1.5672 1.2725 1.1892 7.3616 6.3756 1.0554 1.0363 1.1078 1.0989 1.1015 1.0888 1.0889 1.0959 1.0974
irintensity: 0.0153 0.1129 0.5469 0.2137 0.0524 0.1957 0.2420 0.0129 0.3841 0.0286 2.4023 0.7939 2.2029 0.8591 1.0757 0.0520 0.1133 0.0279 0.1075 0.6594 0.2780 0.6655 0.4624 0.0412 0.7219 1.1775 2.5212 2.5053 0.3905 2.0195 1.0145 0.0075 2.3353 1.5377 15.7641 33.0180 0.2581 0.8890 101.1019 5.4293 111.6123 191.9229 8.9564 183.6205 42.1703 4.1016 48.7944 11.5097 22.8076 16.8175 43.2185 6.7825 14.9408 20.9836 10.0634 0.1151 0.6819 35.2936 48.2233 68.7719 4.6943 6.2343 10.6241 4.6522 5.2702 185.8287 314.5568 268.3941 0.0482 5.5883 2.0811 16.9290 2.0485 16.9050 40.0122 8.0630 253.7458 636.1881 12.8351 77.4192 19.6472 4.6926 19.9839 96.2315 35.1934 24.7995 31.8576 26.3414 32.0075 5.0915 3.6975 10.3067 3.1230
temp: 298.150 k
press: 1.00000 atm
elementType: 17 17 17 17 17 17 16 8 7 7 7 6 6 6 6 6 6 6 6 6 6 6 6 6 1 1 1 1 1 1 1 1 1
symmnumber: 1
zpe: 520630.2 jmol-1
zpe.correction: 0.198298 hartree
zpe.thermalcorrener: 0.222724 hartree
zpe.thermalcorrenthalpy: 0.223668 hartree
zpe.thermalcorrgfe: 0.138010 hartree
zpe.sumelectzpe: -3896.872507 hartree
zpe.sumelectthermal: -3896.848080 hartree
zpe.sumelectthermalent: -3896.847136 hartree
zpe.sumelectthermalfe: -3896.932794 hartree
dipole: 5.9791 -0.8200 1.2939
dipole: 6.1722
quadrupole: -167.9325 -196.4413 -177.8435
quadrupole: -0.7695 11.5634 -1.1199
quadrupole: 12.8066 -15.7022 2.8956 -0.7695 11.5634 -1.1199
hfenergy: -3897.0708044 hartree
pointgroup: C01 [X(C13H9Cl6N3O1S1)]
dipole: -2.3609842 0.1445681 0.5491975 debye
polarizability: 351.8998508|10.4518669|221.1042258|-4.2018141|3.8896789|192.831795 unknown
InChI: InChI=1S/C13H9Cl6N3OS/c1-2-23-7-3-5-8(6-4-7)24-11-21-9(12(14,15)16)20-10(22-11)13(17,18)19/h3-6H,2H2,1H3
charge 0 multiplicity 1
33 atoms
Cl 5.78422 0.16863 -1.349396
Cl 5.255922 2.60861 0.342116
Cl 5.585863 -0.08035 1.670401
Cl 1.880531 -3.471504 1.166543
Cl -0.440841 -2.760442 -0.629407
Cl 2.277818 -3.246989 -1.835381
S  0.038097 2.509471 0.105883
O  -5.331807 -0.242523 -0.350754
N  0.784269 -0.140102 -0.139806
N  2.536775 1.51711 0.111506
N  3.101771 -0.823293 -0.09651
C  -1.576621 1.625688 -0.006453
C  -4.094939 0.375975 -0.158694
C  -2.274889 1.315223 1.176995
C  -2.132061 1.322475 -1.271813
C  -3.538579 0.688207 1.10929
C  -3.387329 0.696018 -1.347755
C  1.218601 1.145812 0.016438
C  1.766253 -1.072453 -0.195004
C  3.421972 0.495066 0.054262
C  -6.123855 -0.608769 0.845086
C  4.919483 0.80796 0.171652
C  1.369433 -2.544457 -0.371475
C  -7.410294 -1.254321 0.339571
H  -1.83853 1.555542 2.151668
H  -1.587199 1.569371 -2.188102
H  -4.066739 0.450378 2.036427
H  -3.839237 0.444853 -2.311582
H  -5.536784 -1.311837 1.470419
H  -6.335377 0.305151 1.436935
H  -8.044313 -1.553325 1.193851
H  -7.979939 -0.549224 -0.289081
H  -7.186074 -2.152449 -0.260429
