program: Gaussian 09
title: 000032302
version: EM64L-G09RevD.01
frameworkgroup: C1[X(C14H16I3NO4)]
method: RPBEPBE
basis: SDD
operation: Freq
keyword: #p
keyword: freq=noraman
keyword: PBEPBE/SDD
title: #p freq=noraman PBEPBE/SDD
converged: NO YES NO NO
title: Mulliken charges:
elementType: I I I O O O O N C C C C C C C C C C C C C C H H H H H H H H H H H H H H H H
charge: 0.146521 0.136022 0.153642 -0.269544 -0.415770 -0.244545 -0.188313 -0.277382 -0.108793 -0.381111 0.760107 0.593912 -0.610699 -0.522403 -0.576453 0.232163 -0.680593 -0.114793 -0.465462 -0.649145 0.154254 -0.680548 0.286891 0.235798 0.234010 0.216803 0.250661 0.223863 0.276542 0.233064 0.234571 0.250119 0.253184 0.251981 0.208338 0.239005 0.231006 0.383094
chargesum: 0.00000
title: Mulliken charges with hydrogens summed into heavy atoms:
elementType: I I I O O O O N C C C C C C C C C C C C C C
charge: 0.146521 0.136022 0.153642 -0.269544 -0.032676 -0.244545 -0.188313 -0.277382 0.178098 0.088697 0.760107 0.593912 -0.610699 -0.522403 -0.576453 0.232163 0.010734 0.161750 0.002173 0.106139 0.154254 -0.002199
polarizability: 3.18934133e+02 3.51811237e+00 2.84502050e+02 -2.28739322e+00 -6.93302810e+00 1.50113541e+02
1716.lowfreq: -6.8726 -0.0004 -0.0003 0.0005 3.2224 5.1612 21.2467 24.0203 26.6084
frequency: 21.0629 23.7975 26.5884 33.4407 46.1457 51.8256 61.1754 71.0372 74.1522 82.9191 84.1609 95.5237 112.0797 130.4529 133.2573 136.3677 152.1348 163.5362 173.6656 193.2894 197.3745 210.9750 234.7672 244.7225 274.5771 296.0073 317.0104 341.8355 373.6401 381.2312 410.0432 446.3505 460.9116 505.7358 534.4616 547.0774 557.3705 583.6823 604.5140 629.8959 647.0010 671.6653 695.1934 718.6693 751.2042 771.5850 804.1826 807.1670 850.2983 873.4954 894.9376 907.8980 971.0669 1008.1748 1013.5903 1021.2509 1059.1862 1065.2066 1075.7092 1081.4046 1096.1568 1110.7498 1122.3062 1144.0850 1205.2801 1228.0106 1232.2750 1248.4061 1262.0400 1269.3070 1278.3441 1310.3766 1320.3780 1341.9616 1355.6351 1362.4027 1396.1443 1399.4346 1401.9439 1437.1800 1440.0063 1456.4542 1467.2805 1472.5308 1477.6339 1478.7620 1479.9373 1485.8709 1513.3528 1534.1936 1605.1053 1690.3799 2965.9532 2975.9510 2991.5841 2998.3201 2998.6745 3017.2083 3032.7632 3054.2800 3069.4659 3082.7036 3094.4138 3104.8722 3107.0119 3107.8682 3180.6573 3517.2247
redmass: 4.4262 5.4424 6.3596 5.7461 9.2223 2.1573 6.9383 2.3374 8.5571 3.0397 2.9200 21.4689 6.1217 3.7930 4.7726 4.0986 4.0224 48.9682 3.5539 1.5092 2.5027 1.3540 3.2833 3.5062 7.3186 4.7343 3.2941 4.2248 7.6713 5.6558 6.2106 5.8808 3.2967 4.7553 3.3636 3.8371 4.6492 1.8193 3.3630 5.8167 5.1364 7.2238 4.4316 5.3268 6.2617 1.7705 1.8323 1.8760 4.4584 1.3890 2.8519 2.7214 4.3288 1.9679 5.5093 2.3796 1.6550 1.9971 1.5990 3.0866 1.3626 2.2873 1.6567 2.9133 2.3121 1.4392 4.2416 1.1841 1.4325 1.2627 2.8479 9.2250 2.9567 1.6720 2.1025 1.9757 1.2155 2.5682 1.3786 1.1366 1.1535 1.0841 1.0396 1.0468 1.0397 1.0714 1.0579 1.0548 10.2193 8.9120 8.9416 9.4791 1.0608 1.0389 1.0366 1.0608 1.0367 1.0981 1.0847 1.1009 1.0962 1.1001 1.1002 1.0993 1.1002 1.1004 1.0932 1.0642
irintensity: 0.1107 0.9715 0.9086 0.1727 1.0490 1.8475 1.3849 0.6512 2.6805 0.6740 0.7785 0.2430 0.4748 0.6784 0.4235 0.1207 0.7065 0.0658 0.1078 0.1701 0.8715 0.2628 2.2579 1.8563 0.6988 7.7942 7.4140 1.3130 2.4999 8.7798 2.0124 6.0410 16.2983 2.0273 5.5731 25.1961 18.6891 63.9062 8.3845 4.9654 91.0966 30.7576 27.9884 11.8531 11.5600 7.1362 21.1892 4.0376 6.2293 12.0734 59.2225 53.9439 50.9953 45.7462 46.8056 220.2600 4.8218 43.1490 0.5085 15.7510 4.4066 70.1300 5.3699 6.1070 97.7771 3.7212 45.0281 1.2272 24.5972 1.4445 41.0328 27.2355 105.9741 10.2075 44.1317 90.8177 28.2956 229.6111 4.1829 4.8300 37.7835 8.3518 10.2167 15.6348 9.5461 34.6554 25.8604 6.8884 11.5516 10.0215 150.8954 192.9728 21.1079 48.3346 31.4120 12.3208 33.7629 10.4545 6.9925 8.9735 14.7466 34.3945 30.6795 24.0888 22.3213 21.4647 0.2559 32.8136
temp: 298.150 k
press: 1.00000 atm
elementType: 53 53 53 8 8 8 8 7 6 6 6 6 6 6 6 6 6 6 6 6 6 6 1 1 1 1 1 1 1 1 1 1 1 1 1 1 1 1
symmnumber: 1
zpe: 721531.0 jmol-1
zpe.correction: 0.274817 hartree
zpe.thermalcorrener: 0.300838 hartree
zpe.thermalcorrenthalpy: 0.301782 hartree
zpe.thermalcorrgfe: 0.212450 hartree
zpe.sumelectzpe: -931.581910 hartree
zpe.sumelectthermal: -931.555889 hartree
zpe.sumelectthermalent: -931.554944 hartree
zpe.sumelectthermalfe: -931.644277 hartree
dipole: 1.7812 0.9703 -0.5957
dipole: 2.1140
quadrupole: -154.3946 -158.2498 -182.2565
quadrupole: 1.0589 -20.1294 -1.5709
quadrupole: 10.5724 6.7171 -17.2895 1.0589 -20.1294 -1.5709
hfenergy: -931.8567265 hartree
pointgroup: C01 [X(C14H16I3N1O4)]
dipole: 0.7362453 -0.3053399 0.2376142 debye
polarizability: 319.3097365|-0.9179942|282.4430792|-1.6745963|-16.4837691|151.7969096 unknown
InChI: InChI=1S/C14H16I3NO4/c1-4-9(14(20)21)22-13-8(16)6-7(15)12(11(13)17)18(3)10(19)5-2/h6,9,20H,4-5H2,1-3H3
charge 0 multiplicity 1
38 atoms
I  0.213149 -1.960049 1.319504
I  3.310465 3.174238 -0.044594
I  -2.770291 3.361071 0.301804
O  -2.27272 0.178656 0.741778
O  -3.44252 -3.068821 -0.459293
O  2.472795 -0.716628 -1.531693
O  -3.679102 -2.072816 1.631771
N  2.699294 0.026681 0.660486
C  -2.691779 -0.813364 -0.289834
C  -3.716438 -0.180261 -1.264946
C  1.460995 0.74709 0.543356
C  -1.027418 0.794152 0.570985
C  0.20795 0.097449 0.715213
C  1.458926 2.141071 0.279687
C  -0.972503 2.200817 0.359413
C  3.144298 -0.701441 -0.460227
C  -5.050326 0.213587 -0.601435
C  0.25745 2.874255 0.21643
C  4.476349 -1.44031 -0.296913
C  3.40994 0.056221 1.959254
C  -3.302207 -2.004971 0.449982
C  4.804562 -2.315506 -1.519069
H  -1.809858 -1.162343 -0.858341
H  -3.886911 -0.911757 -2.077858
H  -3.234227 0.70659 -1.71725
H  -5.692954 0.748543 -1.322999
H  -4.873829 0.874873 0.263596
H  -5.606595 -0.673262 -0.246838
H  0.274922 3.952013 0.042825
H  4.449103 -2.053911 0.6255
H  5.27752 -0.688171 -0.139851
H  4.489996 0.224799 1.814128
H  3.260623 -0.883447 2.525043
H  3.019051 0.891006 2.562723
H  5.780391 -2.815371 -1.383217
H  4.840329 -1.706821 -2.437625
H  4.030256 -3.086683 -1.6703
H  -3.875487 -3.838079 0.000809
