program: Gaussian 09
title: 000032262
version: EM64L-G09RevD.01
frameworkgroup: C1[X(C8H5ClN2S)]
method: RPBEPBE
basis: SDD
operation: Freq
keyword: #p
keyword: freq=noraman
keyword: PBEPBE/SDD
title: #p freq=noraman PBEPBE/SDD
converged: YES YES NO NO
title: Mulliken charges:
elementType: Cl S N N C C C C C C C C H H H H H
charge: 0.066697 0.454630 0.059350 -0.421440 0.324777 0.104920 -0.352971 -0.333465 -0.223388 -0.220809 -0.226767 -0.472125 0.272319 0.270399 0.232518 0.232307 0.233048
chargesum: 0.00000
title: Mulliken charges with hydrogens summed into heavy atoms:
elementType: Cl S N N C C C C C C C C
charge: 0.066697 0.454630 0.059350 -0.421440 0.324777 0.104920 -0.080652 -0.063066 0.009129 0.011499 0.006280 -0.472125
polarizability: 2.09913593e+02 -3.86207250e+00 1.28421240e+02 -1.07494437e-03 1.15693190e-02 4.58372654e+01
1716.lowfreq: -6.8559 -1.7607 -0.0021 -0.0008 0.0025 8.8298 44.8484 87.3844 104.7330
frequency: 44.7985 87.3783 104.7313 203.2792 236.2277 260.7379 298.6054 355.9292 404.1719 466.7090 487.0837 524.9604 602.7433 611.6694 618.7444 694.0270 698.3749 702.1684 788.5252 841.9854 864.1561 933.2984 950.2930 989.3350 995.4126 1007.7046 1020.5795 1072.6295 1085.3230 1174.3862 1186.7645 1256.4621 1322.1344 1383.4813 1395.1281 1437.9542 1455.2286 1495.8530 1588.1018 1613.1231 3130.8380 3142.6365 3155.8778 3166.0624 3174.1024
redmass: 5.0364 7.1429 7.5698 9.7254 10.5385 7.2532 10.8774 11.4959 2.8456 4.2578 10.8538 8.2000 13.9037 8.0368 8.6757 6.1485 8.5785 1.6996 2.0260 10.3425 1.2457 12.6530 1.4174 6.2451 1.3813 1.3277 2.7494 2.4775 1.9677 1.0550 1.1157 5.4550 1.4012 7.6089 4.3757 2.9895 5.7737 3.0030 6.3195 6.0402 1.0854 1.0890 1.0935 1.0961 1.1004
irintensity: 0.0711 1.7902 0.7567 0.2917 0.4852 2.8758 2.0970 0.6829 0.0070 0.2597 9.8895 6.5248 5.5125 10.1583 10.7114 2.6786 0.1599 78.9412 39.5672 11.1681 0.0139 138.7058 6.0731 0.3362 0.0126 0.5645 13.7944 7.6801 4.6031 0.0580 12.6117 33.5186 13.7408 39.6932 70.2442 74.4882 192.5017 1.0154 2.6530 2.6935 0.0320 12.4295 18.0205 11.0011 17.1617
temp: 298.150 k
press: 1.00000 atm
elementType: 17 16 7 7 6 6 6 6 6 6 6 6 1 1 1 1 1
symmnumber: 1
zpe: 293262.8 jmol-1
zpe.correction: 0.111698 hartree
zpe.thermalcorrener: 0.121570 hartree
zpe.thermalcorrenthalpy: 0.122515 hartree
zpe.thermalcorrgfe: 0.074763 hartree
zpe.sumelectzpe: -1274.615581 hartree
zpe.sumelectthermal: -1274.605709 hartree
zpe.sumelectthermalent: -1274.604765 hartree
zpe.sumelectthermalfe: -1274.652516 hartree
dipole: 0.8995 -0.2885 -0.0002
dipole: 0.9446
quadrupole: -68.7891 -81.5326 -86.1992
quadrupole: -1.8477 0.0001 0.0110
quadrupole: 10.0512 -2.6923 -7.3589 -1.8477 0.0001 0.0110
hfenergy: -1274.7272791 hartree
pointgroup: C01 [X(C8H5Cl1N2S1)]
dipole: -0.3578601 0.0999798 -0.0072045 debye
dipolederiv: -0.5996461 -0.3336036 0.0427408 -0.4890417 -0.3524615 0.046217 0.0594427 0.0445198 0.0214752 -0.4224502 0.1460363 -0.0087907 -0.0653379 -0.1716525 0.0458342 0.0139298 0.0437529 0.2410744 -1.3266871 0.0831132 0.0040337 -0.0838489 -0.4787922 0.0427299 0.0222471 0.0408837 -0.0963757 -0.0267079 -0.1547029 0.0138996 0.3373461 -0.3798965 0.0047974 -0.0390693 0.0099669 -0.3027282 -0.2347557 0.0461756 -0.0024039 0.0451005 -0.0262805 0.005148 -0.0026443 0.0051847 0.0249338 1.2607976 -0.0803213 -0.0034678 -0.0327873 0.1846938 -0.0091573 -0.0088035 -0.0087585 0.0959692 -0.0011566 0.0989172 -0.0121114 -0.1115127 -0.0065337 -0.0123993 0.0110412 -0.014614 -0.1290449 0.0216449 -0.120917 0.0117478 0.0810764 0.0006291 -0.0146394 -0.0100314 -0.0124588 -0.1227271 -0.1324136 -0.1248025 0.0134194 -0.153011 0.1172528 -0.0281514 0.0165096 -0.0284162 -0.1523011 -0.0711329 0.1754121 -0.0199604 0.2371123 0.0092123 -0.0202153 -0.0266775 -0.0194691 -0.1503071 0.078922 -0.0141205 -0.0007096 -0.0503193 0.0176769 -0.0172203 0.0031497 -0.0176742 -0.1428021 1.3521541 0.2855136 -0.0462223 0.3069763 1.0740765 -0.128557 -0.0484265 -0.1282636 -0.0697116 0.0864945 -0.0790144 0.0093909 -0.0829257 0.0362883 0.0141639 0.0098518 0.0141059 0.156027 0.1278124 0.0653986 -0.0068945 0.0498674 0.002583 0.0163798 -0.0052964 0.0161477 0.1547145 0.0376461 0.062692 -0.0055932 0.091653 -0.0867972 0.0259516 -0.0087904 0.0262288 0.1566406 -0.0198005 -0.09002 0.0116761 -0.114601 -0.0304031 0.0218495 0.0142644 0.0216072 0.1558894 -0.130721 0.0342437 -0.0007546 0.0342535 0.0904044 0.0072688 -0.0006971 0.0072567 0.1592739 unknown
polarizability: 210.0706762|-0.9811546|127.2837099|-1.6077933|-8.8541695|46.8177131 unknown
InChI: InChI=1S/C8H5ClN2S/c9-8-10-7(11-12-8)6-4-2-1-3-5-6/h1-5H
charge 0 multiplicity 1
17 atoms
Cl 4.203683 1.425633 -0.193777
S  2.965664 -1.445543 0.130103
N  1.545806 0.775363 -0.094948
N  1.169966 -1.571934 0.162606
C  -0.798249 -0.096321 0.023864
C  0.659404 -0.320505 0.032452
C  -1.308026 1.222187 -0.115015
C  -1.695709 -1.19073 0.153089
C  -2.701568 1.441276 -0.124655
C  -3.085942 -0.963673 0.142458
C  -3.593953 0.351411 0.003618
C  2.787965 0.361019 -0.063606
H  -0.604898 2.054792 -0.213418
H  -1.291358 -2.202227 0.259737
H  -3.09048 2.459594 -0.231897
H  -3.77531 -1.809099 0.24197
H  -4.675994 0.523457 -0.004082
