program: Gaussian 09
title: 000032227
version: EM64L-G09RevD.01
frameworkgroup: C1[X(C12H18O)]
method: RPBEPBE
basis: SDD
operation: Freq
keyword: #pfreq=noraman
keyword: PBEPBE/SDD
title: #p freq=noraman PBEPBE/SDD
converged: YES YES NO NO
title: Mulliken charges:
elementType: O C C C C C C C C C C C C H H H H H H H H H H H H H H H H H H
charge: -0.295313 0.220436 0.388098 -0.776700 -0.716950 -0.224071 -0.392035 -0.403087 -0.369030 -0.237664 -0.246363 -0.683159 -0.242589 0.239066 0.215049 0.228529 0.224618 0.210780 0.239073 0.197203 0.185050 0.209272 0.211471 0.238872 0.263337 0.222763 0.224934 0.210675 0.222423 0.207853 0.227458
chargesum: 0.00000
title: Mulliken charges with hydrogens summed into heavy atoms:
elementType: O C C C C C C C C C C C C
charge: -0.295313 0.220436 0.388098 -0.094056 -0.042478 0.158182 0.028708 -0.164214 -0.105693 -0.014901 -0.021428 -0.042208 -0.015131
polarizability: 1.43891174e+02 -1.31859614e+01 1.31379831e+02 -1.13552863e+01 -1.03017587e+01 1.11701803e+02
1716.lowfreq: -22.5958 -10.5439 -0.0005 -0.0005 0.0001 6.5719 28.3661 43.1724 57.3289
frequency: 28.1637 43.0226 57.1569 109.7944 123.8805 159.8466 197.0752 208.8595 221.9025 266.4302 274.1813 290.0204 309.3771 325.4057 375.0286 406.3367 460.0390 492.8748 542.0993 568.9556 615.2861 702.1927 709.5412 763.2765 772.3432 808.8798 858.7641 890.0273 894.9321 910.4943 925.2454 932.1041 983.0690 988.4028 990.4374 1000.2302 1008.4555 1025.2909 1053.6158 1074.6354 1104.0444 1128.0373 1143.2025 1151.5934 1170.8193 1189.6941 1204.3020 1226.7865 1255.9149 1278.1376 1306.5282 1317.2017 1368.3105 1375.9933 1379.8333 1389.8230 1391.9836 1432.4078 1452.4903 1463.7590 1473.5093 1476.7961 1478.3705 1480.7884 1483.3986 1486.6942 1491.7779 1588.8497 1611.0548 2935.9364 2975.1076 2985.4954 2988.5070 2992.2016 2996.2235 3044.9708 3074.5447 3077.8880 3083.0164 3089.9875 3095.9530 3100.3781 3119.4939 3127.2777 3141.3564 3148.5007 3162.1155
redmass: 2.2557 3.4069 2.1268 3.1104 2.9715 2.9157 1.2684 1.1409 2.1193 1.9344 2.3205 1.5456 2.6296 3.8190 3.2625 2.8579 3.3366 3.4683 3.3001 3.1288 6.4250 5.1073 1.7079 1.0828 1.9349 3.4822 1.2516 1.1840 1.7631 1.8234 1.6706 1.4062 1.3771 1.9753 4.2614 1.3245 3.0767 2.3852 2.7703 1.6700 2.0132 2.2416 1.4800 2.0966 1.0544 1.1438 3.3249 1.3079 3.0954 1.1245 1.3665 1.3454 1.3063 2.4736 2.0730 1.2089 1.2181 2.1813 1.0770 1.0563 1.0773 1.1551 1.0436 1.6120 1.0746 1.1084 1.0850 6.0467 5.9904 1.0546 1.0358 1.0706 1.0660 1.0362 1.0601 1.1015 1.1020 1.0991 1.0993 1.1007 1.0999 1.0999 1.0843 1.0875 1.0919 1.0956 1.1013
irintensity: 0.0169 0.3302 0.2842 0.4015 1.0236 1.8240 2.2498 0.5389 3.2489 0.9452 0.3948 0.6189 0.3931 3.1959 2.6689 0.0666 1.4912 5.1486 4.9683 14.2845 0.0692 2.2386 59.1078 5.5345 39.9305 12.1867 0.3271 2.3166 7.7601 0.2751 1.0506 3.8525 0.2688 22.9141 14.9331 0.4549 88.3308 12.5392 8.2075 16.2119 9.1835 2.1235 1.6037 57.8796 0.4236 1.5269 7.6622 1.0320 55.2576 4.4203 0.0854 1.2270 16.9702 10.8626 5.4766 17.9799 15.7518 15.6705 3.1337 2.0250 3.0224 12.8886 10.6165 4.6158 2.3863 18.4584 10.9131 0.6136 3.4008 40.7866 40.8529 13.9726 33.5421 23.4829 29.8364 3.1111 82.0650 50.7332 23.5184 9.7264 59.3584 24.8558 1.0912 3.2149 17.4232 40.4373 20.3974
temp: 298.150 k
press: 1.00000 atm
elementType: 8 6 6 6 6 6 6 6 6 6 6 6 6 1 1 1 1 1 1 1 1 1 1 1 1 1 1 1 1 1 1
symmnumber: 1
zpe: 704652.7 jmol-1
zpe.correction: 0.268388 hartree
zpe.thermalcorrener: 0.282619 hartree
zpe.thermalcorrenthalpy: 0.283563 hartree
zpe.thermalcorrgfe: 0.226763 hartree
zpe.sumelectzpe: -542.283700 hartree
zpe.sumelectthermal: -542.269470 hartree
zpe.sumelectthermalent: -542.268525 hartree
zpe.sumelectthermalfe: -542.325326 hartree
dipole: 0.3564 -0.1732 -1.1770
dipole: 1.2419
quadrupole: -77.6483 -76.4348 -79.1290
quadrupole: -0.2484 -0.6132 -3.8655
quadrupole: 0.0891 1.3025 -1.3916 -0.2484 -0.6132 -3.8655
hfenergy: -542.5520883 hartree
pointgroup: C01 [X(C12H18O1)]
dipole: -0.1257666 0.1561858 -0.4455596 debye
polarizability: 145.5897001|-14.3527457|123.1278299|8.7144305|13.3319191|118.2552781 unknown
InChI: InChI=1S/C12H18O/c1-4-10-13-12(2,3)11-8-6-5-7-9-11/h5-9H,4,10H2,1-3H3
charge 0 multiplicity 1
31 atoms
O  1.512889 -0.764823 0.448423
C  0.312476 -1.38302 -0.191968
C  -0.873321 -0.394967 -0.147634
C  0.659531 -1.87131 -1.617072
C  0.018831 -2.588741 0.729956
C  2.083301 0.402883 -0.244577
C  3.157812 0.994399 0.676147
C  -1.831685 -0.300263 -1.187111
C  -1.045544 0.415949 1.005997
C  -2.93619 0.577309 -1.077169
C  -2.143765 1.294174 1.11785
C  3.863283 2.209619 0.034773
C  -3.098191 1.377041 0.075861
H  1.60043 -2.447298 -1.575731
H  -0.128599 -2.537725 -2.010545
H  0.787757 -1.035609 -2.327374
H  0.871909 -3.289736 0.715216
H  -0.892593 -3.117789 0.400674
H  -0.131108 -2.243832 1.766864
H  1.291608 1.153929 -0.454161
H  2.536953 0.095104 -1.211249
H  2.686046 1.286516 1.63361
H  3.894975 0.20383 0.912898
H  -1.724023 -0.909623 -2.090859
H  -0.295901 0.357466 1.803538
H  -3.667288 0.635559 -1.891886
H  -2.256944 1.914346 2.014632
H  3.143232 3.019145 -0.189475
H  4.633369 2.621821 0.711198
H  4.36237 1.930567 -0.912623
H  -3.953221 2.057179 0.161495
