program: Gaussian 09
title: 000032293
version: EM64L-G09RevD.01
frameworkgroup: C1[X(C12H12I3NO4)]
method: RPBEPBE
basis: SDD
operation: Freq
keyword: #p
keyword: freq=noraman
keyword: PBEPBE/SDD
title: #p freq=noraman PBEPBE/SDD
converged: NO YES NO NO
title: Mulliken charges:
elementType: I I I O O O O N C C C C C C C C C C C C H H H H H H H H H H H H
charge: 0.171866 0.154189 0.130938 -0.265079 -0.416331 -0.188528 -0.216942 -0.488037 -0.111561 -0.378325 0.604580 -0.681627 -0.623817 0.781218 0.154262 -0.572134 -0.578277 -0.098756 0.220873 -0.771220 0.289371 0.236057 0.232823 0.216794 0.250519 0.223505 0.276132 0.318545 0.383211 0.221537 0.264001 0.260213
chargesum: 0.00000
title: Mulliken charges with hydrogens summed into heavy atoms:
elementType: I I I O O O O N C C C C C C C C C C C C
charge: 0.171866 0.154189 0.130938 -0.265079 -0.033120 -0.188528 -0.216942 -0.169492 0.177810 0.090556 0.604580 0.009192 -0.623817 0.781218 0.154262 -0.572134 -0.578277 0.177376 0.220873 -0.025469
polarizability: 2.97775446e+02 6.63208451e+00 2.71543097e+02 -3.37961955e+00 1.49985742e+00 1.24397056e+02
1716.lowfreq: -5.1834 -4.1725 -0.0004 0.0003 0.0003 6.7964 18.2468 29.6980 33.4859
frequency: 17.8375 29.6335 33.4317 45.3960 55.8005 62.4987 71.4565 76.1817 79.5638 91.2308 97.2243 108.9146 118.6226 138.6026 148.2773 161.5377 163.8264 196.0283 222.3058 238.8819 261.0748 297.6139 329.0051 341.8835 377.7626 403.6144 429.9583 458.3432 502.5203 524.0920 545.0037 559.3570 563.2488 587.7994 597.2701 639.0417 647.6850 688.7036 694.6210 728.8072 760.1175 793.6564 848.4432 871.2430 899.0079 910.9020 927.6556 976.2859 1013.9060 1020.3838 1033.8088 1038.5097 1059.0528 1080.7064 1118.3566 1208.8814 1218.2309 1229.3106 1235.4627 1261.9288 1271.3555 1313.9271 1326.7933 1348.2707 1363.2631 1384.1096 1396.0104 1405.9677 1435.0537 1447.6296 1455.9906 1467.9915 1477.9925 1482.8093 1518.6534 1541.2389 1643.1501 1691.0045 2989.1385 2991.3595 2998.5792 3029.4914 3053.4727 3079.7584 3081.6433 3099.4044 3125.3087 3188.3270 3519.0078 3519.8807
redmass: 7.4283 5.7807 6.8540 8.0470 7.0477 5.2333 1.2752 3.6319 9.0427 13.8129 13.9213 2.8212 6.1299 8.2464 6.7115 3.2138 7.0956 1.9761 5.0642 3.5528 5.0329 3.9772 7.7277 4.3656 5.6557 4.9809 5.2489 3.2757 4.8288 1.6349 3.7022 2.9437 3.0112 2.6527 2.1617 7.8976 4.9759 4.5755 7.3339 6.0532 1.9286 3.0382 4.5025 1.3878 2.6632 2.9867 4.9647 2.1504 8.1128 2.3824 2.9712 1.8208 1.6620 3.2329 1.6778 1.7982 3.3328 1.3915 3.6249 1.4213 1.2674 8.8503 2.1877 2.0071 1.7973 1.2332 1.2214 3.2432 1.5271 1.0932 1.3032 1.0660 1.0408 1.0496 8.3853 7.4834 6.9335 9.5238 1.0363 1.0377 1.0610 1.0845 1.1009 1.0985 1.1000 1.1003 1.0987 1.0930 1.0643 1.0768
irintensity: 0.4777 0.4758 1.7696 0.7802 0.2494 2.4518 0.6099 1.3314 4.2118 2.8693 2.8350 0.1333 1.0532 2.0055 0.3956 0.2258 0.3782 0.1995 1.2506 1.1618 2.3553 2.7408 0.8955 0.5556 1.8566 7.0842 9.6546 12.0823 5.2603 61.5751 24.3991 43.5600 30.2746 12.8204 50.7996 6.7712 105.3613 22.1960 56.8042 7.9737 1.4577 26.2277 8.7206 14.2765 31.0724 58.6029 35.5087 36.6872 92.9715 203.1842 14.0324 14.1308 4.1846 13.5971 7.3922 84.4935 146.4606 4.8014 5.0553 23.9756 1.7993 54.9152 80.8260 84.7823 56.2703 64.8980 32.7511 132.4262 224.2454 13.1303 87.8278 18.1020 8.4209 6.1726 20.3376 11.2346 124.0524 196.6771 31.3383 8.2939 13.3404 5.8303 7.6210 12.9926 35.8945 25.8365 7.5915 0.2689 34.0286 24.3900
temp: 298.150 k
press: 1.00000 atm
elementType: 53 53 53 8 8 8 8 7 6 6 6 6 6 6 6 6 6 6 6 6 1 1 1 1 1 1 1 1 1 1 1 1
symmnumber: 1
zpe: 577121.0 jmol-1
zpe.correction: 0.219814 hartree
zpe.thermalcorrener: 0.242829 hartree
zpe.thermalcorrenthalpy: 0.243773 hartree
zpe.thermalcorrgfe: 0.161368 hartree
zpe.sumelectzpe: -853.146464 hartree
zpe.sumelectthermal: -853.123449 hartree
zpe.sumelectthermalent: -853.122505 hartree
zpe.sumelectthermalfe: -853.204910 hartree
dipole: -2.3481 -0.8615 0.4026
dipole: 2.5333
quadrupole: -138.1500 -146.6947 -171.1080
quadrupole: 2.9424 14.8412 5.4475
quadrupole: 13.8342 5.2895 -19.1238 2.9424 14.8412 5.4475
hfenergy: -853.3662781 hartree
pointgroup: C01 [X(C12H12I3N1O4)]
dipole: 0.9699202 0.1398206 0.1819008 debye
polarizability: 299.0616865|0.8259168|269.8665744|7.6042635|-4.5307548|124.7873391 unknown
InChI: InChI=1S/C12H12I3NO4/c1-3-8(12(18)19)20-11-7(14)4-6(13)10(9(11)15)16-5(2)17/h4,8,16,18H,3H2,1-2H3
charge 0 multiplicity 1
32 atoms
I  0.382965 2.122972 -1.347732
I  -1.993542 -3.508485 -0.73423
I  4.027989 -2.733481 -0.231124
O  -1.830839 -0.278183 -0.846846
O  -3.408179 2.718925 0.534375
O  -3.525938 1.815151 -1.607865
O  2.394438 1.574427 1.431056
N  3.068149 0.408708 -0.48277
C  -2.337605 0.613135 0.235832
C  -3.226054 -0.185343 1.224005
C  -0.528238 -0.76475 -0.709111
C  -4.548649 -0.69206 0.615589
C  0.620998 0.079369 -0.751621
C  1.93276 -0.443705 -0.561854
C  -3.128384 1.737693 -0.433558
C  -0.326933 -2.170773 -0.648507
C  2.079984 -1.856008 -0.482571
C  0.969706 -2.717281 -0.563692
C  3.253212 1.368318 0.533236
C  4.553953 2.152829 0.420119
H  -1.48647 1.059042 0.783382
H  -3.428199 0.477407 2.086916
H  -2.620875 -1.032811 1.597428
H  -5.078586 -1.337374 1.338514
H  -4.363784 -1.278308 -0.300235
H  -5.221897 0.145263 0.355588
H  1.105516 -3.799339 -0.52573
H  3.868799 0.188391 -1.080551
H  -3.947968 3.444663 0.118838
H  5.366672 1.581101 -0.061773
H  4.872308 2.460662 1.427631
H  4.37459 3.067945 -0.17454
