program: Gaussian 09
title: 000032196
version: EM64L-G09RevD.01
frameworkgroup: C1[X(C4H9NS)]
method: RPBEPBE
basis: SDD
operation: Freq
keyword: #pfreq=noraman
keyword: PBEPBE/SDD
title: #p freq=noraman PBEPBE/SDD
converged: YES YES NO NO
title: Mulliken charges:
elementType: S N C C C C H H H H H H H H H
charge: 0.152312 -0.315958 -0.351249 -0.335787 -0.641106 -0.649548 0.251551 0.201035 0.229383 0.270091 0.245147 0.272702 0.220959 0.201759 0.248708
chargesum: 0.00000
title: Mulliken charges with hydrogens summed into heavy atoms:
elementType: S N C C C C
charge: 0.152312 -0.043256 -0.099698 0.094630 -0.125867 0.021878
polarizability: 7.88283394e+01 -5.03602685e-01 6.72419689e+01 -3.46967161e+00 -1.04230134e-01 4.80428859e+01
1716.lowfreq: -26.8826 -11.1538 -0.0031 0.0013 0.0028 25.7303 90.4111 226.3423 255.8825
frequency: 90.3345 226.3349 255.8745 264.8938 380.5022 419.2361 475.4369 534.6073 633.8772 669.9860 868.9972 891.1358 953.2043 1001.6955 1011.3962 1068.2049 1100.6554 1145.0598 1155.0081 1195.5820 1213.7860 1271.4901 1318.5734 1349.7299 1385.9989 1396.5571 1447.1324 1463.0549 1466.4011 1472.5760 2886.2790 2916.4389 2977.3858 3035.3175 3049.9826 3070.6957 3111.3348 3125.0504 3483.3419
redmass: 2.7882 1.0527 2.0227 2.7171 1.3236 3.7828 4.3686 4.0809 4.3838 2.5502 1.6882 2.0440 2.0422 1.4934 1.3530 1.9178 2.1479 1.3121 2.8403 1.3423 1.1707 1.2068 1.3981 1.2770 1.3152 1.2998 1.0964 1.0493 1.0481 1.0922 1.0703 1.0841 1.0397 1.0801 1.0664 1.0946 1.1003 1.1104 1.0758
irintensity: 1.6630 0.3312 6.5819 18.7946 135.9893 1.1118 8.6661 1.7314 6.9788 9.2756 5.1765 5.5181 7.0488 5.4055 3.5675 14.9354 5.0050 1.9288 11.1248 3.2297 27.4729 13.3632 39.2407 1.9819 38.2498 9.7153 5.3358 8.6356 8.1615 3.5748 114.0982 84.6300 38.5751 14.0950 55.0876 24.1912 21.8356 21.9409 0.2214
temp: 298.150 k
press: 1.00000 atm
elementType: 16 7 6 6 6 6 1 1 1 1 1 1 1 1 1
symmnumber: 1
zpe: 333657.3 jmol-1
zpe.correction: 0.127083 hartree
zpe.thermalcorrener: 0.133894 hartree
zpe.thermalcorrenthalpy: 0.134838 hartree
zpe.thermalcorrgfe: 0.096404 hartree
zpe.sumelectzpe: -610.123778 hartree
zpe.sumelectthermal: -610.116967 hartree
zpe.sumelectthermalent: -610.116023 hartree
zpe.sumelectthermalfe: -610.154457 hartree
dipole: 0.2969 2.5697 0.7541
dipole: 2.6945
quadrupole: -39.8132 -44.9378 -46.7040
quadrupole: -0.1784 -1.3790 1.4968
quadrupole: 4.0051 -1.1195 -2.8856 -0.1784 -1.3790 1.4968
hfenergy: -610.2508612 hartree
pointgroup: C01 [X(C4H9N1S1)]
dipole: -0.1666868 -0.9970088 0.3193388 debye
dipolederiv: -0.3250596 0.0882152 -0.0288952 0.0952462 -0.2254566 0.0170497 -0.0405861 0.0191784 -0.1970129 -0.6480747 -0.0207699 0.0737025 -0.0416267 -0.416814 -0.1078004 0.0602016 -0.1596646 -0.6261477 0.5370142 -0.0388527 0.0965397 -0.0512118 0.5416123 0.003135 0.0718284 -0.0112618 0.4552267 0.365549 -0.0532324 -0.1443262 -0.1131558 0.1349494 0.0601224 -0.1322787 -0.0572142 0.4116984 0.2836742 0.0534886 0.0492419 0.1417559 -0.0424293 0.0913952 0.0908468 0.0950968 0.1358915 -0.1306259 -0.0635609 0.0696788 0.0441811 0.0393685 0.0097135 0.0464022 0.0112286 -0.0137944 -0.0668537 0.0213215 -0.0112451 0.0076553 -0.0750735 0.0369576 -0.0971216 -0.003753 -0.2534103 -0.0573274 -0.0002179 0.0471785 0.0458525 0.0388139 -0.0147628 0.1734956 0.0600352 -0.2581463 -0.0250776 -0.0892133 -0.0331463 -0.1516993 -0.0671366 -0.0591146 -0.0452541 -0.0788951 0.0495912 0.001089 -0.0352691 -0.0483172 -0.0693899 0.0354601 -0.0315332 -0.09102 0.0086684 -0.1277876 -0.1324435 0.0685488 0.0457332 0.0307362 0.04936 -0.0356906 0.0696787 -0.0353638 0.0537418 0.1205187 0.0232672 -0.0316566 0.0436579 0.0161183 0.0347266 -0.0848061 0.165505 0.321774 0.0085082 -0.0715198 -0.0244664 -0.1370148 -0.0300852 -0.0635865 -0.0494167 -0.0756597 0.0690117 -0.031702 0.1094013 -0.0094912 0.1587277 -0.1018909 0.0478708 0.0033543 0.0539072 0.0886743 0.1008111 0.0083935 -0.0505302 -0.0037143 0.1032036 0.0115173 0.0246757 0.0081925 -0.1093104 unknown
polarizability: 78.7603638|-1.0026911|67.3085059|3.4438121|-0.4985538|48.0443245 unknown
InChI: InChI=1S/C4H9NS/c1-4-5-2-3-6-4/h4-5H,2-3H2,1H3
charge 0 multiplicity 1
15 atoms
S  -0.11652 1.567608 0.065325
N  0.021915 -1.105764 -0.124006
C  0.889139 -0.049208 0.413101
C  -1.394754 -0.855051 0.197469
C  -1.681829 0.5622 -0.342892
C  2.26172 -0.01882 -0.259892
H  0.987073 -0.076318 1.521721
H  -1.614384 -0.87836 1.292448
H  -2.032038 -1.60756 -0.301701
H  -1.815727 0.55624 -1.434887
H  -2.54235 1.035871 0.154666
H  0.363212 -2.061319 0.032249
H  2.868231 0.824685 0.114274
H  2.818799 -0.95349 -0.049035
H  2.140414 0.084086 -1.350541
