program: Gaussian 09
title: /home/michael/molsimp_comfiles/Ru_3a1_19_OOH/Ru_3a1_19_OOH.com auto generated
version: ES64L-G09RevE.01
frameworkgroup: C1[X(C27H20N6O4Ru)]
method: UTPSSh
basis: Gen
operation: Freq
keyword: #P
keyword: Geom=AllCheck
keyword: Guess=TCheck
keyword: SCRF=Check
keyword: GenChk
keyword: UTPSSh/ChkBas
keyword: Freq
title: /home/michael/molsimp_comfiles/Ru_3a1_19_OOH/Ru_3a1_19_OOH.com auto ge
converged: YES YES NO YES
polarizability: 7.41847271e+02 2.57023633e+01 7.22782693e+02 2.35772252e+01 3.97319556e+01 5.99629044e+02
1716.lowfreq: -7.0749 0.0003 0.0007 0.0009 2.4724 16.2396 21.1057 22.7647 28.9808
frequency: 20.3764 21.9794 23.5507 34.8267 44.8714 48.3569 54.3147 66.2900 80.8506 104.1242 109.8773 128.9905 135.0316 156.7412 162.6140 167.3176 173.6442 177.4976 180.9377 191.5622 196.5735 223.5576 241.9938 255.8619 268.5984 284.7705 288.7640 305.4998 324.6181 347.5475 371.2534 390.4219 393.6802 398.9595 403.1130 421.6859 438.6969 467.0981 475.5088 477.5320 477.9748 498.8411 508.5220 510.0645 532.2682 534.7327 535.6482 544.7961 558.7613 571.6585 578.4168 638.1282 648.0524 648.3506 662.2464 666.0901 674.3520 693.5434 723.8842 755.6345 766.3990 768.0799 769.6880 774.2925 784.9991 786.6979 792.8621 793.3829 794.8928 819.1258 843.1739 844.3043 846.2384 852.4624 858.4912 862.3144 881.1920 892.4866 893.2970 908.5187 950.1464 975.9384 986.4233 986.8079 988.6050 988.9691 999.0624 1002.5212 1021.9361 1022.3448 1024.5005 1025.8737 1032.9766 1033.9931 1034.8331 1052.4864 1069.2084 1093.5315 1101.2662 1103.4824 1111.9693 1142.5973 1156.6607 1160.7270 1171.2693 1173.4561 1177.9624 1187.8392 1189.3948 1200.1701 1219.0457 1243.4195 1255.7177 1286.5742 1288.9990 1299.9059 1312.3904 1315.3694 1319.1358 1324.3198 1337.7719 1346.5891 1361.5708 1367.3354 1432.3843 1438.3028 1445.0362 1454.8074 1457.6260 1480.8651 1484.1175 1486.5079 1491.3608 1526.3536 1538.7788 1541.4187 1552.9531 1583.9142 1590.6155 1600.0581 1604.6368 1610.5137 1623.5744 1626.3937 1645.4600 1649.3988 1661.3980 1661.9337 2939.3965 3209.7557 3211.8735 3216.2040 3217.9665 3225.1898 3226.3118 3229.4817 3232.1333 3232.4923 3233.5026 3233.6687 3236.3828 3240.9475 3244.1411 3247.3122 3252.0455 3256.7164 3278.2314 3290.2501
redmass: 6.0095 5.1167 6.3717 5.9165 5.0628 6.2044 6.9093 9.8353 6.9849 4.1436 6.2934 6.8955 7.3531 8.1036 7.6478 6.2533 7.2889 4.2883 4.4308 7.9059 6.9290 6.9938 7.8290 6.5249 7.7842 5.2092 7.1695 8.6417 10.4579 8.2888 8.5702 3.5994 3.6448 7.5096 4.8913 5.0620 3.5836 4.4567 4.3512 3.0943 3.1512 3.7416 6.1813 4.5118 7.0622 8.0946 7.1327 8.1113 9.2944 4.0631 7.5919 7.3479 7.1565 6.7402 6.9072 4.4682 4.2871 7.9764 5.8274 1.9730 1.3560 1.3669 7.7023 1.8684 5.2850 3.1447 2.9933 2.5999 5.4007 1.5979 4.0017 2.4387 4.8029 4.6992 1.3743 1.3264 7.6322 1.5049 1.4925 1.3576 1.4010 5.2058 5.2962 1.3201 1.3791 1.3284 1.3571 1.3576 1.3140 1.3386 1.3197 1.3274 7.3814 2.3363 2.3113 6.8592 3.3677 3.3482 2.3144 3.1318 1.7333 1.7270 1.4979 1.4394 1.2315 1.1676 1.1446 1.4362 1.7047 1.5081 1.6907 3.0127 3.1901 1.7716 1.8019 3.0832 2.7212 5.4663 2.8690 2.2778 3.0263 3.0114 2.6634 4.5646 2.5013 6.6795 6.6620 1.9953 2.0602 2.3175 2.2970 2.1456 2.5131 3.0435 1.8536 3.0480 1.4420 6.6093 6.0186 6.3008 9.1386 6.6414 5.6878 5.8317 5.8500 5.6685 5.6779 5.7419 1.0757 1.0871 1.0874 1.0895 1.0895 1.0954 1.0958 1.0890 1.0986 1.0930 1.0988 1.0894 1.0931 1.0921 1.0942 1.0965 1.0961 1.0974 1.0943 1.0935
irintensity: 2.6566 5.1199 3.8559 4.6300 3.5794 8.4912 0.5341 1.6404 1.9548 5.0518 2.5483 2.7676 0.2296 0.5439 1.9988 2.5634 2.2665 9.0986 5.9896 0.0766 1.3065 8.0236 10.0587 3.8005 0.9117 0.7972 1.6848 65.2290 26.8256 14.9014 1.9184 3.0866 3.6833 36.6598 28.4303 11.8116 9.1474 6.4318 7.0658 12.6486 13.8444 0.7830 9.4337 3.8728 1.7363 2.9139 6.5209 6.7806 33.1151 0.0963 9.5746 5.4093 4.4740 5.2561 9.0710 2.4987 1.7624 35.7846 46.5300 1.8420 12.9740 96.8202 41.0198 111.2738 12.1589 1.7630 13.0058 44.9556 34.6347 279.3017 147.5113 15.4769 76.0755 321.6698 32.9999 85.5782 24.1438 5.5625 9.5828 0.0619 0.0160 6.0765 14.6278 0.7964 2.9598 1.1630 4.1485 4.0613 0.0061 0.0347 0.0057 0.2914 4.2160 3.9722 4.4402 0.1557 6.6708 20.7958 1.6169 9.4403 17.1176 4.0083 10.6594 16.9307 8.8930 7.7687 15.7981 10.3678 44.9606 3.5285 75.2056 21.7931 24.3262 4.1307 5.0899 169.6406 23.3871 26.8671 28.6075 128.0321 5.8572 21.8725 54.3101 72.8610 26.2696 77.3275 82.4834 12.0961 17.4232 3.4879 3.3328 5.6584 167.5234 1.0518 50.1021 46.8983 39.9198 48.1491 61.4998 242.6812 1424.9498 114.8823 46.8102 31.9686 9.9919 12.1048 2.4856 2.8023 1649.0436 0.0396 0.1285 3.8752 2.9493 16.8066 10.7174 3.1794 24.5294 0.2877 18.9709 2.6168 0.5215 0.1240 0.5279 0.2554 1.5413 6.9018 8.3768 6.7678
temp: 298.150 k
press: 1.00000 atm
elementType: 44 8 6 8 6 6 6 6 6 6 6 6 6 6 7 7 1 1 1 1 1 1 1 8 8 1 7 6 6 6 6 6 6 6 6 7 1 1 1 1 1 1 7 6 6 6 6 6 6 6 6 7 1 1 1 1 1 1
symmnumber: 1
zpe: 1134310.2 jmol-1
zpe.correction: 0.432036 hartree
zpe.thermalcorrener: 0.462877 hartree
zpe.thermalcorrenthalpy: 0.463821 hartree
zpe.thermalcorrgfe: 0.367994 hartree
zpe.sumelectzpe: -1763.785785 hartree
zpe.sumelectthermal: -1763.754944 hartree
zpe.sumelectthermalent: -1763.754000 hartree
zpe.sumelectthermalfe: -1763.849827 hartree
dipole: -2.7636 19.9578 -4.5267
dipole: 20.6505
quadrupole: -76.2894 -158.8084 -227.4719
quadrupole: 7.0652 -8.2038 6.9766
quadrupole: 77.9005 -4.6185 -73.2820 7.0652 -8.2038 6.9766
hfenergy: -1764.2178213 hartree
pointgroup: C01 [X(C27H20N6O4Ru1)]
dipole: 4.1494268 6.9028622 1.0680544 debye
polarizability: 699.2566899|62.7617186|623.8582635|-35.8145606|-0.4704673|741.1440545 unknown
InChI: InChI=1S/C11H7N2O2.2C8H6N2.H2O2.Ru/c14-11(15)10-6-3-5-9(13-10)8-4-1-2-7-12-8;2*1-2-4-8-7(3-1)5-6-9-10-8;1-2;/h1-7H;2*1-6H;1-2H;/q-3;2*-1;;+6/p-1
charge 1 multiplicity 2
58 atoms
Ru -0.14507208 0.13899413 -0.1918245
O  2.12774014 -3.32854025 -0.43967879
C  1.65370857 -2.17876331 -0.37503837
O  0.38606439 -1.91769025 -0.21708143
C  2.54614623 -0.96748667 -0.46940543
C  3.92657467 -0.97338847 -0.64176687
C  4.59387183 0.25591324 -0.69996075
C  3.88243083 1.45075242 -0.57821319
C  2.49490295 1.39665345 -0.40196724
C  1.5658037 2.5265452 -0.2367491
C  1.9447117 3.86849853 -0.19514451
C  0.96827256 4.85194603 -0.03808823
C  -0.36951329 4.47165105 0.07335117
C  -0.69558584 3.11912505 0.02681652
N  0.24559654 2.16579155 -0.12297145
N  1.87371541 0.19445667 -0.35980409
H  4.45697826 -1.91432998 -0.72731124
H  5.66895832 0.28378425 -0.83709051
H  4.39464697 2.40426966 -0.61911358
H  2.99053614 4.13685962 -0.2832963
H  1.25097085 5.89804153 -0.00379246
H  -1.15988773 5.20273395 0.19566994
H  -1.71697128 2.76850055 0.10665952
O  -2.08680409 0.26274994 -0.35018858
O  -2.9780519 0.29117758 0.77893421
H  -2.40271091 -0.08848031 1.5194929
N  -0.03150343 0.00277335 1.9117961
C  1.10112719 0.24210742 2.62985124
C  1.1672051 0.01278887 3.98886883
C  0.03404322 -0.49050739 4.65087456
C  -0.03090286 -0.77968759 6.03884971
C  -1.20384947 -1.26214286 6.57658557
C  -2.35229815 -1.47320548 5.76197873
C  -2.32525333 -1.20256327 4.41292464
C  -1.12468021 -0.70718246 3.83618806
N  -1.11304629 -0.45220888 2.50172322
H  1.94656779 0.62512771 2.07693044
H  2.08597562 0.21924327 4.52683734
H  0.84796566 -0.61517347 6.65344348
H  -1.26108708 -1.48706574 7.63652429
H  -3.25995167 -1.85475896 6.21760162
H  -3.19041362 -1.36101826 3.77799015
N  -0.28151225 0.12240941 -2.29434779
C  0.21483357 1.10745097 -3.09918674
C  0.09996282 1.05364468 -4.47052931
C  -0.54896569 -0.05212853 -5.05067091
C  -0.73532934 -0.23976545 -6.44506375
C  -1.38579949 -1.36716587 -6.89796297
C  -1.87494903 -2.34607764 -5.98833533
C  -1.71205453 -2.19313504 -4.63022846
C  -1.04313117 -1.03919667 -4.13714137
N  -0.89746727 -0.92417236 -2.7885821
H  0.69705227 1.93562381 -2.59957396
H  0.50349097 1.85392095 -5.08138963
H  -0.35989651 0.51021263 -7.13364904
H  -1.53068321 -1.51734277 -7.96290579
H  -2.38230461 -3.22291105 -6.37708134
H  -2.07845595 -2.92931749 -3.92276815
