program: Gaussian 09
title: /home/michael/molsimp_comfiles/Mn_31a_1_OH/Mn_31a_1_OH.com auto generated
version: ES64L-G09RevE.01
frameworkgroup: C1[X(C31H24MnN7O)]
method: UTPSSh
basis: Gen
operation: Freq
keyword: #P
keyword: Geom=AllCheck
keyword: Guess=TCheck
keyword: SCRF=Check
keyword: GenChk
keyword: UTPSSh/ChkBas
keyword: Freq
title: /home/michael/molsimp_comfiles/Mn_31a_1_OH/Mn_31a_1_OH.com auto genera
converged: YES YES NO NO
polarizability: 7.93128539e+02 4.36553444e+01 6.30266192e+02 -5.86532822e+01 -4.39054984e+01 5.82713367e+02
1716.lowfreq: -9.9640 -2.0931 0.0006 0.0008 0.0009 11.2432 20.6209 23.1226 25.2653
frequency: 17.3508 21.6303 24.7715 30.2918 34.3056 42.3825 48.3180 62.6602 82.7246 93.5003 97.7393 104.3624 105.4038 114.5053 125.1769 127.4796 150.7633 163.3182 181.7716 193.2150 208.7736 214.2965 220.1435 231.0077 236.3550 239.1557 266.5187 275.0860 280.0554 321.5557 357.5140 384.5124 390.6760 392.4681 393.5714 412.0124 418.0030 429.3950 440.4437 451.7704 452.1905 476.3088 477.2259 486.7813 489.3850 518.2656 530.7789 531.4697 531.7910 535.1989 543.3470 605.3852 630.2902 638.4644 640.7588 641.2683 644.1718 652.7146 659.8301 661.0593 663.5862 731.5499 740.7680 748.8812 757.5437 762.1707 767.0705 781.1161 782.7134 784.5365 791.9923 794.7238 802.7815 838.4422 840.4718 840.7815 844.6274 863.4849 864.9645 894.0986 896.3521 911.2625 915.5467 938.8454 974.9971 975.6170 984.9560 987.2479 989.2247 991.4595 995.8007 1002.6515 1004.2183 1021.4884 1022.1976 1023.4124 1026.3921 1026.9977 1028.2869 1028.7951 1032.7892 1034.3248 1034.7374 1051.2120 1078.9852 1093.8989 1096.1698 1096.5607 1120.0157 1129.6301 1144.1806 1156.9338 1157.6196 1161.6598 1172.8630 1173.4317 1179.8014 1183.8467 1189.7189 1190.3408 1223.4253 1249.1936 1251.8945 1284.5104 1286.1343 1311.5342 1312.8204 1316.4704 1319.2190 1325.8636 1330.7513 1338.2437 1341.2412 1342.6155 1361.0841 1367.8234 1436.1962 1441.0228 1441.3593 1453.6690 1454.5008 1472.2090 1484.2906 1486.9271 1488.5444 1493.5831 1514.5762 1534.5179 1538.9130 1542.3356 1583.3350 1584.9214 1611.2059 1616.6892 1621.4334 1621.8349 1627.1619 1638.3572 1643.0275 1647.9285 1660.3447 1660.9196 3212.5189 3213.2341 3218.9446 3219.6137 3220.2429 3222.7330 3225.9367 3227.7823 3227.9333 3228.8885 3229.7211 3234.3292 3234.5809 3234.9477 3236.5039 3241.9202 3242.4345 3247.0425 3248.1579 3253.9570 3257.0786 3257.9482 3261.2605 3494.0531
redmass: 5.4629 5.6239 5.5190 5.6196 5.1173 5.4636 4.5730 5.5137 5.2063 5.2086 5.8444 5.8981 5.7301 6.6583 5.8299 6.3221 6.7032 6.5922 4.1425 4.1090 6.0537 6.0585 6.8738 5.1356 7.5979 6.4374 8.8116 6.5207 8.7772 8.0830 6.6469 3.3330 3.7397 4.4814 4.5937 3.5105 3.5290 6.3975 4.0748 1.2292 3.7761 3.1619 3.0365 2.8008 3.4864 3.1388 7.2203 5.3742 7.1344 7.7393 7.9000 15.6010 7.3800 7.3360 5.0199 5.0378 6.8572 7.2074 4.7592 4.6039 6.9350 6.7220 2.8710 2.5615 1.9501 1.3380 1.3338 5.0606 1.2502 5.5495 3.4753 3.5859 2.1183 5.8359 5.0765 2.5413 6.0254 1.3052 1.3071 1.5091 1.4985 1.3306 1.3163 1.3981 5.3398 5.3714 1.1052 1.3967 1.3336 1.3199 1.3866 1.3548 1.3565 6.9929 1.3572 1.3258 1.3213 1.3404 1.3967 5.5596 2.3087 2.4725 6.0762 6.6167 2.5129 2.4834 2.9991 2.2574 1.7521 1.6232 1.6383 1.4982 1.4881 1.6477 1.2093 1.1946 1.1455 1.4046 1.3520 1.2595 1.3194 2.9845 2.9110 1.8170 1.7722 2.4628 2.7552 2.1099 2.9730 1.6150 7.4286 2.9783 3.0660 2.9791 3.2930 5.0632 2.3048 6.8555 6.0385 2.0713 1.9778 2.2240 2.3271 2.0638 2.2946 2.7271 2.4946 2.7365 3.0512 2.9522 6.6704 6.6903 5.8368 5.7844 5.6708 5.5433 6.4549 4.6650 5.3171 6.2627 5.6461 5.6335 1.0873 1.0874 1.0896 1.0895 1.0895 1.0881 1.0914 1.0956 1.0957 1.0911 1.0906 1.0988 1.0923 1.0988 1.0916 1.0960 1.0958 1.0971 1.0967 1.0924 1.0953 1.0967 1.0959 1.0670
irintensity: 0.0317 0.6148 0.3248 0.8841 1.9725 4.7196 1.8220 0.7918 1.5645 0.7356 2.0387 2.3468 1.4646 2.3655 1.0759 0.0655 3.2940 0.3673 9.8195 3.2612 6.9396 13.8452 20.5009 5.8131 18.7066 22.2984 46.9084 19.4063 41.0792 64.7110 2.0380 3.6533 10.9201 7.8107 7.4468 10.4842 1.5292 0.9346 7.9407 198.3143 0.0984 11.5896 1.0149 11.1752 0.3663 7.9187 3.7980 0.1902 7.6824 9.6806 0.8610 455.9535 3.6332 16.9124 3.4730 1.6723 29.0898 23.4611 0.6664 3.5976 20.7898 1.3876 24.9965 0.7630 0.1060 54.5256 50.7859 3.7775 260.4237 32.1326 11.6250 9.0841 0.6829 9.7714 0.4034 3.5353 16.4044 52.2027 103.8836 15.7976 14.3077 1.1225 0.0652 0.1067 2.1708 3.2738 201.7154 3.8979 1.8688 2.2294 0.8985 1.1140 2.4094 10.0805 0.3757 0.0062 0.0193 0.5565 2.0619 34.2689 6.8037 8.1087 39.8841 2.2278 6.7676 52.9527 29.6320 10.8245 13.8228 4.1532 5.7430 8.4073 12.1313 0.1252 8.8224 11.9934 6.7411 11.3205 12.1078 17.0353 23.3073 9.4820 8.4086 0.1184 1.1453 0.6099 13.2846 40.8669 25.0892 13.8475 14.4149 8.8260 75.9309 29.3484 9.9422 36.1661 9.2166 148.3664 29.5598 10.7057 19.5723 72.4864 31.1188 172.2750 21.7162 28.5883 139.1390 16.3324 12.1350 10.1053 23.1497 12.3673 42.9542 60.7893 41.5737 59.8142 83.3748 63.1726 84.0203 1.8363 5.0791 8.3236 0.2844 0.2764 3.1827 2.7122 6.6254 6.5508 3.6258 12.5527 11.4804 1.1884 9.3428 18.4467 1.4668 16.7798 1.1908 10.3989 7.3898 3.9414 1.8597 1.6463 1.6783 1.2021 1.8907 756.1138
temp: 298.150 k
press: 1.00000 atm
elementType: 25 6 6 6 6 6 6 6 6 6 6 6 6 6 6 7 7 7 6 1 1 1 1 1 1 1 1 1 1 1 7 6 6 6 6 6 6 6 6 7 1 1 1 1 1 1 7 6 6 6 6 6 6 6 6 7 1 1 1 1 1 1 8 1
symmnumber: 1
zpe: 1297989.1 jmol-1
zpe.correction: 0.494378 hartree
zpe.thermalcorrener: 0.527106 hartree
zpe.thermalcorrenthalpy: 0.528050 hartree
zpe.thermalcorrgfe: 0.426696 hartree
zpe.sumelectzpe: -1757.611018 hartree
zpe.sumelectthermal: -1757.578290 hartree
zpe.sumelectthermalent: -1757.577346 hartree
zpe.sumelectthermalfe: -1757.678700 hartree
dipole: -0.9798 -4.8331 -7.1391
dipole: 8.6767
quadrupole: -78.6805 -150.6303 -153.5987
quadrupole: -16.1509 -17.4234 -14.1490
quadrupole: 48.9560 -22.9938 -25.9622 -16.1509 -17.4234 -14.1490
hfenergy: -1758.1053964 hartree
pointgroup: C01 [X(C31H24Mn1N7O1)]
dipole: -1.3414604 0.6257712 3.0760473 debye
polarizability: 736.4072731|-57.026187|659.338634|91.7533429|-61.1725634|610.3621911 unknown
InChI: InChI=1S/C15H11N3.2C8H6N2.Mn.H2O/c1-3-10-16-12(6-1)14-8-5-9-15(18-14)13-7-2-4-11-17-13;2*1-2-4-8-7(3-1)5-6-9-10-8;;/h1-11H;2*1-6H;;1H2/q3*-1;+4;/p-1
charge 2 multiplicity 5
64 atoms
Mn -0.24485316 0.01624251 0.1756238
C  -0.23870298 -4.52781775 -0.02501878
C  1.12145998 -4.82950332 0.02702627
C  2.04497345 -3.79129187 0.15161748
C  1.58200244 -2.47312814 0.22572073
C  2.48759224 -1.30459669 0.35147504
C  3.87691138 -1.41097277 0.48710302
C  4.63073123 -0.24461323 0.60286058
C  3.99965583 0.99785287 0.58609118
C  2.60791267 1.041317 0.44692562
C  1.82081406 2.29798283 0.42523139
C  2.39791271 3.57158475 0.46792268
C  1.56677945 4.69171528 0.44394664
C  0.18428603 4.51804108 0.37290172
C  -0.31912263 3.21915005 0.32851717
N  0.47906044 2.14091833 0.35881768
N  1.89112396 -0.0953048 0.33096036
N  0.25910883 -2.18844743 0.17837788
C  -0.62461346 -3.19047025 0.05068265
H  -0.99023292 -5.30217897 -0.12576184
H  1.46461692 -5.8567375 -0.03354123
H  3.10507899 -4.00921493 0.18270275
H  4.36290158 -2.3781016 0.50715012
H  5.70812131 -0.30423436 0.71081762
H  4.5787765 1.90729717 0.68390444
H  3.47304026 3.69194196 0.51431917
H  1.99814779 5.68643515 0.47650128
H  -0.49397831 5.36290976 0.34898788
H  -1.38521418 3.02777768 0.2649597
H  -1.6717663 -2.91207234 0.00708007
N  -2.3889854 -0.31034016 -0.03574662
C  -3.19837973 -0.83922907 0.92069855
C  -4.56787901 -0.90243596 0.75690674
C  -5.1269717 -0.39679518 -0.42980102
C  -6.51610661 -0.38085191 -0.72253491
C  -6.95109758 0.13963945 -1.92134153
C  -6.03076892 0.65903488 -2.8763198
C  -4.6780383 0.65761988 -2.62787566
C  -4.20365815 0.13132197 -1.39500469
N  -2.86523118 0.15428831 -1.16700209
H  -2.70313884 -1.21475358 1.80666547
H  -5.19164193 -1.33222433 1.53296658
H  -7.21344782 -0.77866621 0.00731317
H  -8.01183048 0.1573194 -2.14931274
H  -6.40914402 1.06107093 -3.81016967
H  -3.96185757 1.05013912 -3.34172266
N  -0.3474402 0.05348345 2.2647054
C  -1.13929141 0.96568683 2.89645987
C  -1.18221664 1.05017622 4.27194619
C  -0.38345828 0.16784327 5.02257398
C  -0.32412359 0.14354923 6.44035804
C  0.49537795 -0.76768749 7.07038788
C  1.28482109 -1.6879717 6.32406808
C  1.25158834 -1.69240903 4.94906451
C  0.4149887 -0.76088025 4.27362769
N  0.41017452 -0.79320605 2.91497061
H  -1.72803115 1.6075865 2.25290082
H  -1.81909523 1.78210975 4.75617413
H  -0.92699434 0.84598725 7.00634863
H  0.54486188 -0.79014089 8.15417174
H  1.91848085 -2.39186815 6.85331175
H  1.84525089 -2.38475516 4.36182015
O  -0.15671129 0.08355208 -1.62975903
H  -1.08011097 0.25240411 -1.93055966
