program: Gaussian 09
title: /home/michael/molsimp_comfiles/Ru_31a_16_OH/Ru_31a_16_OH.com auto generated
version: ES64L-G09RevE.01
frameworkgroup: C1[X(C32H23N4O4Ru)]
method: UTPSSh
basis: Gen
operation: Freq
keyword: #PGeom=AllCheck
keyword: Guess=TCheck
keyword: SCRF=Check
keyword: GenChk
keyword: UTPSSh/ChkBas
keyword: Freq
title: /home/michael/molsimp_comfiles/Ru_31a_16_OH/Ru_31a_16_OH.com auto gene
converged: YES YES NO YES
polarizability: 8.30449823e+02 2.34497216e+00 7.40963950e+02 -2.68454777e+01 -1.53926530e+02 6.67630652e+02
1716.lowfreq: -5.1171 0.0003 0.0005 0.0008 7.2441 12.1491 15.5652 22.7351 26.0780
frequency: 14.6507 21.6339 25.8768 27.3293 32.2231 42.8080 54.4362 73.1912 76.5142 105.0463 115.2802 121.1437 124.6226 139.9206 148.7476 162.7806 177.1312 182.3301 187.6979 197.1066 200.3213 219.0608 227.1157 235.0584 251.4163 267.3107 277.1706 289.9524 303.9723 309.9324 317.6847 338.5909 348.3879 363.3570 383.7091 388.5551 392.7184 395.0202 419.4666 455.6018 474.4926 476.5791 478.8356 480.3440 487.8947 492.9215 499.6037 503.7668 522.3417 523.6919 540.1753 541.3644 542.6985 554.4192 580.4843 590.4561 613.7188 642.3591 643.7679 646.7555 649.8602 650.8473 659.9067 696.9285 700.2359 742.6455 752.3882 761.4048 762.1784 765.2637 772.3632 776.1254 776.8802 787.2629 790.7729 810.6006 820.4483 829.1984 830.2482 843.6826 848.1803 859.6793 866.4831 885.1022 890.9669 895.4577 904.0652 925.8139 934.5097 947.3348 954.4713 962.8616 964.9212 972.4630 980.2011 983.2214 984.6181 990.2564 991.8197 1002.1484 1014.4103 1017.0526 1025.9830 1039.8233 1040.6030 1060.0759 1062.8420 1069.7243 1074.4037 1105.9516 1156.6525 1157.1970 1159.4748 1169.0313 1174.4327 1175.9986 1187.6806 1192.9969 1201.1712 1215.0595 1245.4402 1249.4832 1252.4671 1265.0267 1279.2115 1282.0906 1292.2798 1300.4260 1302.3085 1321.0241 1335.2855 1349.3173 1370.0837 1375.5569 1376.6507 1409.4576 1415.1100 1427.1683 1429.2868 1431.4061 1435.8884 1464.7525 1473.4463 1473.9517 1475.2465 1491.9888 1495.1457 1514.8460 1524.9551 1541.1812 1541.7520 1542.2094 1562.9295 1593.7995 1606.8631 1608.6623 1637.7102 1640.8959 1642.2295 1648.4900 1662.2850 1672.1008 1672.6815 3196.7075 3198.1720 3200.1918 3202.6451 3204.8207 3207.9732 3211.8606 3212.6487 3212.9674 3213.6539 3214.5522 3216.1086 3217.8286 3222.9348 3224.3885 3226.0039 3227.0097 3230.5642 3232.2515 3245.9197 3251.3425 3637.2806 3734.7698
redmass: 6.2317 5.1536 5.6911 5.9496 5.5368 4.5548 8.7272 6.3099 5.0683 6.3988 5.9287 6.1412 5.9031 6.6494 6.0982 6.5713 6.1282 3.8573 4.2573 5.8795 6.4557 5.7858 5.5706 7.4528 5.9077 5.9036 7.8652 6.1391 5.8896 2.0444 3.3513 8.1966 6.9853 5.9071 4.2288 4.5848 3.2154 3.1550 10.0357 2.7386 3.1122 2.8414 4.3920 2.3352 6.4664 3.7274 2.7251 3.6445 6.8438 6.8391 6.6665 3.8112 7.2812 6.9725 3.8608 6.8594 7.7546 6.6880 6.6464 4.5443 3.7285 4.9641 5.7577 4.8370 6.2709 6.0995 4.3132 1.6252 1.3313 1.2464 1.5445 3.5262 3.7697 4.7208 4.7853 10.3589 2.9519 6.0544 6.1493 1.3771 1.3506 6.4268 1.4864 1.3984 1.3927 6.3962 1.1225 1.3969 1.4844 1.4341 1.3350 4.9977 5.2318 1.3191 1.3078 1.2891 1.3736 1.3741 1.2738 8.3222 1.2951 1.2966 5.7993 2.3784 2.4023 2.6392 2.5929 2.1695 1.8950 3.1629 1.4963 1.4882 1.4477 1.3407 1.1197 1.1145 1.3981 1.3777 1.3986 2.3830 2.1196 2.1596 1.7371 3.2990 1.6260 1.6464 1.8498 1.9004 3.7123 2.6199 4.4675 3.4784 4.7623 3.5286 3.5826 1.7573 1.6615 5.3463 7.2308 7.2154 2.8672 4.3025 2.6467 2.5696 2.4986 2.1006 2.0387 2.5043 4.0803 3.3947 6.4070 3.5519 4.1183 5.2025 6.3546 6.0871 7.9468 5.1858 5.1065 5.4108 5.8931 5.9882 6.0705 1.0862 1.0865 1.0866 1.0890 1.0890 1.0878 1.0876 1.0950 1.0939 1.0921 1.0950 1.0904 1.0911 1.0982 1.0983 1.0916 1.0975 1.0913 1.0967 1.0952 1.0950 1.0816 1.0666
irintensity: 0.7040 1.7705 8.1794 0.2661 5.1458 1.8381 5.1653 4.0282 0.1883 0.4128 2.6036 2.9422 2.0031 5.8122 1.3159 0.1773 2.3459 3.0452 2.1424 0.5482 1.0307 2.2162 17.7354 3.2499 1.6249 11.3484 18.2617 6.9528 1.1262 202.1792 56.0891 18.7292 145.6368 2.8178 4.3523 9.3972 0.7889 1.4318 1.4789 27.5865 39.5859 13.3611 14.5358 21.4748 293.7220 18.6813 191.8333 11.4636 1.1960 1.2639 1.1093 3.4645 3.3875 48.7439 5.0732 12.5701 25.0784 5.5627 12.8867 17.1435 6.6388 37.4878 5.1846 3.0786 5.1616 3.0514 1.8855 117.8250 105.9439 37.8390 33.2598 4.4130 4.8358 0.0738 0.3109 140.4398 2.4878 0.2122 5.4931 85.8113 85.6099 63.9032 6.6655 16.6083 20.7571 30.2881 113.0325 0.3885 10.8641 9.3914 4.4227 1.0369 2.2908 0.2196 2.3781 1.1649 5.5259 3.3728 0.3866 10.5169 0.0074 0.0071 15.9553 8.4383 10.7224 20.8452 4.2954 13.1283 32.8263 39.2690 3.8265 3.8705 39.0540 15.4788 3.4270 4.5410 9.1511 3.6188 9.4322 183.2690 10.8594 17.5894 11.9600 216.1012 3.5573 2.2928 24.7979 19.6310 491.5299 49.3410 379.3742 181.0802 203.6567 0.4463 0.7045 29.4882 37.4542 93.8085 21.2294 36.6341 41.5977 68.8881 92.1360 74.5803 2.2644 0.8748 5.1964 369.6604 589.6260 146.8180 877.2931 132.7419 286.9638 23.4243 6.1860 3.5212 76.7446 11.5696 14.9162 58.6456 35.2212 56.7997 18.0466 5.5887 1.6034 1.1616 0.4740 0.5708 0.1027 5.4947 34.1903 47.7038 3.0920 30.3939 3.6924 5.1182 39.4037 34.1522 2.5886 47.3041 4.6128 22.1551 9.0194 7.9977 298.9886 41.9675
temp: 298.150 k
press: 1.00000 atm
elementType: 44 8 6 8 6 6 6 6 6 7 6 6 6 6 6 6 6 8 7 6 1 1 1 1 1 1 1 1 7 6 6 6 6 6 6 6 6 6 1 1 1 1 1 1 1 7 6 6 6 6 6 6 6 6 6 1 1 1 1 1 1 1 8 1
symmnumber: 1
zpe: 1274331.6 jmol-1
zpe.correction: 0.485367 hartree
zpe.thermalcorrener: 0.518600 hartree
zpe.thermalcorrenthalpy: 0.519545 hartree
zpe.thermalcorrgfe: 0.418875 hartree
zpe.sumelectzpe: -1846.902962 hartree
zpe.sumelectthermal: -1846.869729 hartree
zpe.sumelectthermalent: -1846.868785 hartree
zpe.sumelectthermalfe: -1846.969455 hartree
dipole: 3.4837 4.3530 14.2612
dipole: 15.3123
quadrupole: -135.3534 -219.1157 -267.4303
quadrupole: -0.8603 -8.6418 8.8927
quadrupole: 71.9464 -11.8159 -60.1305 -0.8603 -8.6418 8.8927
hfenergy: -1847.3883296 hartree
pointgroup: C01 [X(C32H23N4O4Ru1)]
dipole: 2.2358263 -3.0999967 4.6565567 debye
polarizability: 813.7645385|34.9317872|849.8929404|-75.2982298|43.950561|575.3869466 unknown
InChI: InChI=1S/C14H8N2O3.2C9H7N.H2O.Ru/c17-11-7-2-1-4-8(11)13-15-10-6-3-5-9(14(18)19)12(10)16-13;2*1-2-4-9-7-10-6-5-8(9)3-1;;/h1-7,15H;2*1-7H;1H2;/q-3;2*-1;;+6/p-1
charge 0 multiplicity 2
64 atoms
Ru -0.24435342 -0.32019764 -0.35203619
O  0.41225992 3.81483521 -0.99091386
C  0.66800522 2.59023347 -0.8728625
O  -0.27014111 1.7574806 -0.51135821
C  2.06350298 2.11285167 -1.13513211
C  3.06288425 3.02121269 -1.51584303
C  4.38839005 2.61856782 -1.75337438
C  4.79072171 1.28620316 -1.62359194
C  3.80528781 0.37495133 -1.24590185
N  3.82435001 -0.9930857 -1.03120813
C  2.56239155 -1.40327193 -0.68304091
C  2.16852861 -2.7644945 -0.37934551
C  3.1501641 -3.78481607 -0.39055864
C  2.84376537 -5.10565612 -0.10233492
C  1.51801375 -5.44668689 0.21315635
C  0.53360038 -4.47046901 0.2353659
C  0.81505162 -3.11301909 -0.05701202
O  -0.23236148 -2.28469076 0.00516389
N  1.74449719 -0.34325403 -0.65770478
C  2.47286579 0.7724622 -1.0049365
H  2.79597216 4.06634473 -1.62715789
H  5.12001886 3.36449105 -2.0459887
H  5.8139892 0.97809445 -1.80833469
H  4.63631525 -1.58895657 -1.13524917
H  4.17907138 -3.53184426 -0.62629087
H  3.62228922 -5.86082337 -0.11968428
H  1.25748841 -6.47577987 0.44257436
H  -0.4943926 -4.7221621 0.47866714
N  -2.34680025 -0.31446259 -0.10927164
C  -3.08475162 -1.33517429 -0.65946539
C  -4.44872303 -1.41762019 -0.52426794
C  -5.15111205 -0.42300732 0.20673302
C  -6.55751801 -0.43341822 0.39802623
C  -7.16210217 0.57276847 1.12505749
C  -6.39629013 1.62695 1.68853308
C  -5.02832873 1.6649596 1.51902986
C  -4.38059398 0.64113339 0.77576461
C  -2.97891801 0.63392571 0.57988919
H  -2.51632541 -2.07483048 -1.209389
H  -4.98623687 -2.24403386 -0.97790273
H  -7.14385319 -1.23936204 -0.03302018
H  -8.23802083 0.56223022 1.27032068
H  -6.89654652 2.40548603 2.25570302
H  -4.43229758 2.46654642 1.94534586
H  -2.36489861 1.4258144 0.99734301
N  -0.06213181 -0.05656644 1.76181352
C  -0.82014256 -0.85295275 2.58958322
C  -0.80581229 -0.72361514 3.95554889
C  0.00940204 0.26511453 4.56753507
C  0.07677026 0.47174587 5.96949203
C  0.89959602 1.45552236 6.48173883
C  1.686373 2.26906062 5.62512018
C  1.64160767 2.09208193 4.25819001
C  0.80092431 1.08842173 3.70519886
C  0.71916253 0.87279193 2.3089243
H  -1.425611 -1.59876766 2.09043175
H  -1.42193296 -1.37724156 4.56425086
H  -0.52385916 -0.15053821 6.62592208
H  0.94920321 1.61302518 7.55483379
H  2.32519678 3.03416468 6.05466538
H  2.23781067 2.70859574 3.59189135
H  1.3094563 1.48254284 1.63395047
O  -0.51573258 -0.56859733 -2.31623184
H  0.35127541 -0.50086 -2.75253042
