program: Gaussian 09
title: /home/michael/molsimp_comfiles/Mn_3a1_30_OOH/Mn_3a1_30_OOH.com auto generated
version: ES64L-G09RevE.01
frameworkgroup: C1[X(C17H14MnN3O6)]
method: UTPSSh
basis: Gen
operation: Freq
keyword: #P
keyword: Geom=AllCheck
keyword: Guess=TCheck
keyword: SCRF=Check
keyword: GenChk
keyword: UTPSSh/ChkBas
keyword: Freq
title: /home/michael/molsimp_comfiles/Mn_3a1_30_OOH/Mn_3a1_30_OOH.com auto ge
converged: YES YES NO YES
polarizability: 3.66714416e+02 -1.28734209e+00 4.23585246e+02 -1.42299096e+01 -1.68785741e+01 3.98802534e+02
1716.lowfreq: -18.8305 0.0005 0.0007 0.0010 15.2065 18.2039 25.7043 33.1262 34.0721
frequency: 22.9412 32.3288 32.5607 35.8444 54.8420 56.9182 67.2327 82.8689 88.8675 105.5536 114.3340 120.1491 132.9156 142.8625 148.7630 156.6302 172.1053 178.0368 184.5634 200.1776 212.9403 220.1237 241.1823 285.0557 293.4612 320.4134 367.1469 389.8980 390.4172 410.9374 428.6443 435.3447 447.8557 478.5420 511.4014 521.1037 579.8101 629.4819 640.3517 650.8929 652.4725 670.1759 688.2430 700.1714 701.2425 708.4110 765.7822 769.8193 773.2125 793.2753 806.5193 862.1824 888.1311 892.6197 913.0539 916.0269 960.9451 967.0213 972.0674 998.6747 1004.2736 1028.2907 1029.9840 1032.3234 1033.3713 1034.4017 1039.3204 1044.3998 1045.2874 1089.0589 1089.7538 1098.3077 1098.5849 1101.8910 1171.6136 1171.8942 1172.2713 1198.0499 1214.9990 1231.1206 1233.2891 1317.1297 1325.5915 1326.9749 1345.4435 1379.9018 1382.7283 1384.0841 1386.8692 1442.0493 1479.5844 1479.8212 1499.7266 1518.4871 1520.4629 1586.4123 1595.3120 1616.6389 1619.5442 1621.7241 1640.9670 1650.7060 1651.0966 3219.3683 3219.8939 3227.4565 3230.8909 3231.8882 3236.0552 3236.4697 3243.8998 3244.4071 3244.4661 3248.5518 3249.1474 3253.9537 3673.7078
redmass: 4.2567 6.1020 5.6853 4.3490 5.3294 7.5275 8.6873 8.3231 7.0624 7.1211 9.1743 7.5556 5.3090 2.3054 4.7319 6.4746 5.5060 8.0497 8.0223 7.1839 9.0089 8.5310 3.6238 7.0051 9.0470 5.7642 13.1672 2.6632 2.6816 10.1619 3.9301 3.9068 4.0708 6.2878 18.2446 11.0136 7.2292 6.8674 6.8666 6.3267 6.3376 7.8770 7.3175 1.7435 1.8044 10.3243 1.7716 1.7248 1.7554 12.5976 7.6890 2.6348 1.2504 1.2485 8.0941 15.3950 1.4009 1.3098 1.3107 1.4346 1.4275 7.4383 1.3253 1.3210 1.3564 6.5801 7.5756 6.0621 5.6278 1.7146 1.7162 1.6361 1.6541 1.7442 1.1400 1.0797 1.0792 6.7852 2.1608 1.2249 1.2256 10.2002 8.2824 8.2535 1.1040 7.1984 1.3791 1.2238 3.6306 3.7796 2.2419 2.2438 3.0171 1.9350 1.9321 12.2178 10.7817 7.0613 5.4385 5.3539 7.0100 5.1910 5.1723 1.0883 1.0886 1.0900 1.0895 1.0893 1.0947 1.0939 1.0932 1.0965 1.0973 1.0966 1.0981 1.0951 1.0687
irintensity: 1.2498 4.4175 7.8999 3.0026 6.8809 1.6556 19.2448 20.4171 5.9795 19.1027 10.0614 2.3719 9.2623 80.2748 40.4040 6.0307 13.8200 26.7650 24.9741 21.9730 20.3285 144.9473 67.1427 29.3999 101.3417 98.6382 3.6776 0.0214 0.1745 33.1652 7.6124 10.2133 18.3439 0.1245 171.9775 0.2838 6.8247 5.5855 30.6569 0.5595 1.4339 77.2593 63.5418 122.3437 91.8850 140.5262 32.8793 44.5865 65.2515 7.7331 0.0904 9.3572 0.0601 0.3494 56.3918 227.8146 0.0146 1.5134 2.2888 0.0626 0.1063 14.7430 0.0322 0.0247 0.0033 39.5671 53.8185 4.7600 0.6684 7.7674 81.6234 28.6745 21.6857 0.8834 1.0799 3.7153 3.4622 39.8216 3.4954 33.6923 18.5125 212.4810 4.5845 5.2297 70.2375 819.2250 7.7989 2.4297 121.7093 215.4214 58.6928 91.0861 1.2496 5.4227 7.6023 1762.8515 971.5440 139.6800 3.2087 0.5973 17.0394 7.3055 98.6418 3.8750 4.5443 4.6667 0.6034 0.6674 2.0157 0.1619 0.2804 5.1893 8.8671 0.6384 8.9260 12.3624 160.1220
temp: 298.150 k
press: 1.00000 atm
elementType: 25 8 6 8 6 6 6 6 6 6 8 8 7 1 1 1 8 8 1 7 6 6 6 6 6 1 1 1 1 1 7 6 6 6 6 6 1 1 1 1 1
symmnumber: 1
zpe: 769674.0 jmol-1
zpe.correction: 0.293153 hartree
zpe.thermalcorrener: 0.318964 hartree
zpe.thermalcorrenthalpy: 0.319908 hartree
zpe.thermalcorrgfe: 0.233314 hartree
zpe.sumelectzpe: -1375.639432 hartree
zpe.sumelectthermal: -1375.613622 hartree
zpe.sumelectthermalent: -1375.612678 hartree
zpe.sumelectthermalfe: -1375.699272 hartree
dipole: 2.7910 1.3945 0.1871
dipole: 3.1256
quadrupole: -82.0210 -145.8785 -217.3403
quadrupole: -9.0027 15.5431 13.7579
quadrupole: 66.3922 2.5348 -68.9270 -9.0027 15.5431 13.7579
hfenergy: -1375.9325856 hartree
pointgroup: C01 [X(C17H14Mn1N3O6)]
dipole: 0.5896361 0.1147312 -1.0730043 debye
polarizability: 415.8982805|20.2955236|407.8786792|7.2399802|-9.9467636|365.3252362 unknown
InChI: InChI=1S/C7H3NO4.2C5H5N.Mn.H2O2/c9-6(10)4-2-1-3-5(8-4)7(11)12;2*1-2-4-6-5-3-1;;1-2/h1-3H;2*1-5H;;1-2H/q3*-1;+4;/p-1
charge 0 multiplicity 5
41 atoms
Mn -0.0742088 0.01366876 0.1818938
O  2.27721896 -3.48217525 0.62876293
C  1.76532002 -2.35079756 0.465124
O  0.50869853 -2.09885418 0.36292845
C  2.65814094 -1.13404351 0.36825293
C  4.05153327 -1.1693162 0.38708534
C  4.75299469 0.03407491 0.2794184
C  4.05026282 1.23615827 0.16306189
C  2.65578202 1.1999378 0.16008191
C  1.76133335 2.41900355 0.06493767
O  0.50259271 2.17272366 0.15775381
O  2.28191705 3.54907204 -0.08398136
N  1.99651813 0.03211496 0.25841698
H  4.56226588 -2.12023276 0.48182833
H  5.83762182 0.03464992 0.2874325
H  4.56280032 2.18689805 0.07920572
O  -1.94218293 0.0221419 0.10773179
O  -2.40648972 -1.1802374 -0.52849548
H  -2.45498543 -0.91732661 -1.46891225
N  -0.18326198 0.04007312 2.35301394
C  -0.95717146 -0.90907716 2.92180589
C  -1.10323025 -1.01638983 4.30104704
C  -0.42929891 -0.11084834 5.12359387
C  0.36864781 0.8708873 4.53369036
C  0.46769104 0.91559607 3.14585058
H  -1.46632228 -1.58381169 2.24361044
H  -1.73635796 -1.7937549 4.71327416
H  -0.52633664 -0.1679582 6.20278355
H  0.90862607 1.59676857 5.13083167
H  1.07110127 1.66656022 2.6512074
N  -0.00030358 0.07372308 -1.94265252
C  -0.48527412 1.16470541 -2.57394398
C  -0.48094145 1.27409042 -3.96084209
C  0.03528904 0.22156547 -4.72020526
C  0.52482731 -0.9095913 -4.06410559
C  0.48934686 -0.94957974 -2.67358611
H  -0.8742195 1.95272845 -1.93988721
H  -0.87568586 2.16909856 -4.42795395
H  0.05312346 0.28099059 -5.80346495
H  0.92971555 -1.75201784 -4.6130263
H  0.85367193 -1.8069006 -2.11994332
