program: Gaussian 09
title: /home/michael/molsimp_comfiles/Co_31a_18_VAC/Co_31a_18_VAC.com auto generated
version: ES64L-G09RevE.01
frameworkgroup: C1[X(C24H18CoN4O3)]
method: UTPSSh
basis: Gen
operation: Freq
keyword: #P
keyword: Geom=AllCheck
keyword: Guess=TCheck
keyword: SCRF=Check
keyword: GenChk
keyword: UTPSSh/ChkBas
keyword: Freq
title: /home/michael/molsimp_comfiles/Co_31a_18_VAC/Co_31a_18_VAC.com auto ge
converged: YES YES NO YES
polarizability: 5.38215403e+02 -4.54530637e+01 6.48187748e+02 1.28883853e+01 -1.20714441e+01 3.02836661e+02
1716.lowfreq: -15.9299 0.0007 0.0009 0.0011 10.8396 16.0463 18.1128 22.2261 28.8728
frequency: 9.8682 18.0021 27.8988 31.3835 37.6411 45.6929 47.2854 56.3708 81.0399 107.4567 121.5707 124.7645 131.6268 147.2966 147.7994 152.3338 167.1638 170.4058 203.9057 218.9661 238.2045 250.3969 265.8785 287.2541 312.6091 329.6517 343.0110 387.4908 389.5150 392.2981 423.9509 429.6624 441.7338 459.2982 477.6574 501.1867 520.4932 536.9306 576.4121 579.0157 594.9497 612.5909 631.1572 633.2790 652.6993 653.0541 653.4461 686.0525 703.5203 706.4932 707.9909 744.3024 751.1888 761.4885 765.9474 768.0591 768.7269 792.1866 822.3530 855.2212 857.7657 888.7320 896.8913 898.8005 919.2191 939.3117 968.4000 969.4877 977.8485 986.2635 986.4976 1002.4026 1002.6837 1024.1431 1028.1582 1029.4381 1029.9409 1031.5953 1044.2969 1044.4622 1063.3522 1071.8538 1089.3596 1089.8331 1092.5880 1093.9221 1097.2355 1153.8659 1168.2378 1169.8489 1170.0171 1178.9891 1221.8038 1227.9985 1229.7030 1235.2115 1275.4237 1291.2939 1298.0084 1325.8503 1326.8593 1335.2384 1365.5349 1370.9113 1380.0263 1380.7067 1411.8872 1425.0176 1454.5160 1471.1050 1478.6090 1479.5688 1505.1848 1513.9905 1518.4088 1518.7718 1525.7837 1551.8836 1586.7303 1622.7077 1623.2741 1633.1144 1646.7644 1650.3277 1651.1393 1660.9341 3182.0542 3186.0910 3200.5506 3206.2440 3212.9050 3214.1256 3218.8403 3218.9765 3219.1934 3221.5646 3223.2670 3226.8490 3229.1908 3233.5851 3234.6963 3239.1884 3240.0808 3624.4355
redmass: 5.5053 5.7254 5.1901 4.0703 5.4948 5.2716 5.1998 5.5564 6.8402 6.1093 6.9620 6.0393 5.7344 6.1587 5.6592 6.3280 7.1378 6.8791 13.0317 11.2305 5.8744 9.2680 7.0976 9.2647 9.5288 7.6183 5.7033 2.6462 2.6539 10.8740 3.8523 3.9378 2.3952 7.6760 2.5424 2.4227 5.2881 3.4044 6.8077 3.9716 6.8845 7.4484 6.8603 6.8413 5.7486 6.3191 6.3235 6.7934 4.2476 1.6800 1.6490 6.0502 3.3822 1.5797 1.8271 1.7642 1.8746 10.3065 3.2826 6.2046 1.5748 6.3204 1.2462 1.2470 1.4079 1.3452 1.3106 1.3062 1.2834 2.4086 2.0366 1.4382 1.4390 5.4876 1.3125 1.3226 6.9213 6.9198 5.7116 5.6420 2.3238 1.8428 1.7063 1.7067 1.6989 1.7161 3.0095 1.4633 1.2394 1.0841 1.0835 1.2247 2.4401 1.2326 1.2377 1.6819 2.8803 3.6301 2.2506 8.4295 8.3693 4.2581 6.3482 7.3271 1.2220 1.2342 4.0198 4.7428 4.2055 2.7847 2.2116 2.2325 2.5446 5.2370 1.9673 1.9710 5.3743 4.5397 5.6307 5.4828 5.4462 7.8612 5.5057 5.2314 5.2182 6.9113 1.0876 1.0878 1.0939 1.0875 1.0877 1.0876 1.0882 1.0894 1.0968 1.0914 1.0931 1.0921 1.0966 1.0960 1.0960 1.0999 1.0997 1.0820
irintensity: 2.2441 6.9357 5.4623 4.0355 5.6136 1.9219 2.1005 4.8133 7.1975 8.1367 9.2427 8.8387 1.5534 1.2589 0.1320 2.5544 5.7935 21.8456 31.5403 17.2940 8.8051 24.8550 34.0159 59.2005 26.5935 68.4026 4.9907 0.1664 0.0354 2.4704 16.2933 16.4164 56.1074 14.5275 25.1690 92.2204 64.3976 1.6231 30.3537 2.3392 16.9269 9.9812 8.7719 12.7069 2.9511 1.3266 0.3935 8.7423 4.3277 70.3290 129.6040 4.7879 23.4824 192.5976 29.4617 9.3042 25.5406 125.4730 0.8359 38.5909 10.7292 38.5872 0.0773 0.0258 0.7670 4.9507 0.4733 1.6770 1.4509 1.7814 1.0676 0.2795 0.0957 4.2767 0.0307 0.3510 17.9592 21.4332 8.2445 6.6972 23.9950 21.5985 26.6042 28.0971 16.9627 0.3027 10.7204 76.3811 4.3380 3.8942 3.4712 12.2193 66.4242 15.4228 18.6456 14.1843 149.4018 433.0319 70.8020 1.4536 0.1395 92.3640 210.8452 721.5566 2.6976 12.4453 80.6584 146.2801 106.0722 239.4070 75.4927 66.5149 494.0708 1415.7881 4.1013 10.0124 359.1880 429.9960 63.5590 10.3820 7.0766 66.3554 134.3055 65.5668 59.8393 52.9278 22.8877 4.5512 50.0645 5.5652 2.2767 1.8904 7.2258 4.2627 42.9873 8.4808 5.3918 3.4092 20.7655 25.3414 23.2860 5.4720 5.9401 214.3308
temp: 298.150 k
press: 1.00000 atm
elementType: 27 8 6 8 6 6 6 6 6 7 6 6 6 6 6 6 6 8 7 6 1 1 1 1 1 1 1 1 7 6 6 6 6 6 1 1 1 1 1 7 6 6 6 6 6 1 1 1 1 1
symmnumber: 1
zpe: 986604.5 jmol-1
zpe.correction: 0.375778 hartree
zpe.thermalcorrener: 0.403234 hartree
zpe.thermalcorrenthalpy: 0.404178 hartree
zpe.thermalcorrgfe: 0.312465 hartree
zpe.sumelectzpe: -1515.034428 hartree
zpe.sumelectthermal: -1515.006972 hartree
zpe.sumelectthermalent: -1515.006027 hartree
zpe.sumelectthermalfe: -1515.097741 hartree
dipole: -1.4515 9.7309 5.4151
dipole: 11.2304
quadrupole: -104.1517 -226.7313 -161.8387
quadrupole: 2.2500 0.0537 -15.6867
quadrupole: 60.0889 -62.4907 2.4018 2.2500 0.0537 -15.6867
hfenergy: -1515.4102054 hartree
pointgroup: C01 [X(C24H18Co1N4O3)]
dipole: 0.2806618 3.5578286 2.6048108 debye
polarizability: 514.5130665|-37.5021432|643.5036592|-75.7189765|41.7127454|331.2230864 unknown
InChI: InChI=1S/C14H8N2O3.2C5H5N.Co/c17-11-7-2-1-4-8(11)13-15-10-6-3-5-9(14(18)19)12(10)16-13;2*1-2-4-6-5-3-1;/h1-7,15H;2*1-5H;/q-3;;-1;+4
charge 0 multiplicity 4
50 atoms
Co 0.04105503 0.29554341 0.02600098
O  0.65823948 -3.81485096 -1.12001833
C  0.92442411 -2.59431389 -0.92231319
O  0.06364115 -1.77108621 -0.42935646
C  2.29172504 -2.08793226 -1.28237028
C  3.26098912 -2.95285856 -1.81160915
C  4.54094748 -2.50905266 -2.18410999
C  4.91882397 -1.17040152 -2.05110696
C  3.9603125 -0.30576229 -1.52467848
N  3.97899783 1.05364776 -1.2665545
C  2.76378917 1.42294154 -0.74877824
C  2.42353129 2.77911254 -0.36534131
C  3.43596933 3.77113663 -0.36178785
C  3.17500031 5.08952696 -0.02400704
C  1.86221552 5.45614961 0.32520432
C  0.85002822 4.51040275 0.33342674
C  1.07991367 3.14689222 -0.00336386
O  0.04921951 2.32241035 0.02568669
N  1.9625735 0.34732172 -0.66028375
C  2.6731036 -0.73893928 -1.13818281
H  3.00418273 -3.99902188 -1.93830457
H  5.25115174 -3.22258899 -2.58948685
H  5.90357743 -0.82194332 -2.34321979
H  4.75634017 1.67321409 -1.45707503
H  4.45567615 3.49748313 -0.61773632
H  3.97478138 5.82259737 -0.0263069
H  1.63764734 6.48475986 0.5944645
H  -0.16531276 4.78756832 0.6040152
N  -2.17401443 0.28580691 -0.03207525
C  -2.86080406 -0.6657545 0.63347518
C  -4.25238445 -0.71278022 0.65461625
C  -4.9685489 0.26273142 -0.0424469
C  -4.26306708 1.24796987 -0.73665088
C  -2.87024537 1.22473789 -0.70491138
H  -2.26596185 -1.40546617 1.15859339
H  -4.75691188 -1.49771926 1.20709022
H  -6.05379633 0.25502634 -0.04500405
H  -4.77621546 2.02379754 -1.29383202
H  -2.28229838 1.97203651 -1.22686936
N  0.03390572 -0.1602337 2.1411802
C  -0.64870919 0.62591158 2.99950426
C  -0.69408715 0.37701017 4.3689165
C  -0.00747505 -0.72918973 4.87493097
C  0.70112044 -1.54458424 3.99006639
C  0.69623308 -1.22711431 2.6340405
H  -1.16610775 1.4737247 2.5629007
H  -1.25677807 1.03816523 5.01840709
H  -0.02377709 -0.95072394 5.93721979
H  1.24935293 -2.41328189 4.33731116
H  1.22941528 -1.83311265 1.90964947
