program: Gaussian 09
title: /home/michael/molsimp_comfiles/Cr_3a1_4_OOH/Cr_3a1_4_OOH.com auto generated
version: ES64L-G09RevE.01
frameworkgroup: C1[X(C33H26CrN5O2)]
method: UTPSSh
basis: Gen
operation: Freq
keyword: #P
keyword: Geom=AllCheck
keyword: Guess=TCheck
keyword: SCRF=Check
keyword: GenChk
keyword: UTPSSh/ChkBas
keyword: Freq
title: /home/michael/molsimp_comfiles/Cr_3a1_4_OOH/Cr_3a1_4_OOH.com auto gene
converged: YES YES NO YES
polarizability: 6.98406752e+02 6.69114814e+01 6.55700773e+02 -1.15898882e+01 8.09068256e+00 6.97643995e+02
1716.lowfreq: -14.5476 -0.0003 0.0006 0.0007 4.8007 9.5142 18.2690 20.7691 24.0524
frequency: 17.6193 20.6457 22.7313 33.6637 41.4413 48.6685 51.8334 70.3770 77.9031 96.1072 100.5162 106.4017 114.8318 123.4972 131.4478 137.8137 146.1321 166.5410 174.2207 179.5996 184.9257 189.6318 209.4433 224.3487 228.5234 239.9612 249.5909 277.7235 288.7950 304.5989 318.2240 343.9720 356.1084 378.1236 381.9023 392.8447 394.8782 420.8929 424.8675 435.4317 443.9009 446.9118 459.1322 474.9119 479.8388 487.6615 491.4540 505.1874 520.2361 526.1324 526.1791 538.3946 542.5106 543.0807 637.8459 641.7895 643.2945 643.9784 646.6738 648.5744 649.8574 652.6380 669.6132 729.7159 741.9189 754.1126 761.8990 763.0936 764.7608 777.9755 779.9847 782.7314 790.7925 791.5597 800.3109 832.6348 832.8544 838.9328 840.7199 842.4452 847.1730 889.5959 892.0842 899.9696 916.9172 919.5269 938.9620 954.1643 958.5364 966.1385 966.6639 976.7540 981.0877 989.9571 992.2850 996.5532 999.3585 1019.2150 1019.6277 1025.1668 1030.0685 1031.4277 1032.2591 1033.4342 1040.3434 1040.6478 1044.6148 1051.1603 1065.4192 1070.4847 1076.4488 1094.0454 1118.1142 1128.3906 1142.3492 1157.4662 1157.8101 1161.8256 1176.3732 1176.8097 1181.9789 1187.2054 1203.0713 1207.9502 1223.4179 1251.5470 1254.0260 1283.6040 1285.3613 1294.1123 1298.7379 1310.0600 1317.2607 1324.6991 1328.1141 1337.6014 1340.8825 1370.6237 1375.5052 1375.8112 1376.8077 1413.8448 1418.1978 1433.3961 1433.7019 1435.3448 1473.9652 1474.8787 1475.3300 1484.3259 1493.9659 1497.2152 1497.8365 1513.6618 1538.9361 1545.5621 1545.8601 1605.9478 1606.4185 1606.7270 1614.0937 1617.9763 1641.1906 1641.5015 1641.9600 1647.7927 1650.8104 1671.4223 1672.0324 3201.5600 3202.1045 3206.2751 3206.8185 3215.8955 3216.7069 3221.1183 3223.6895 3224.3941 3225.1866 3225.9406 3226.6236 3229.7363 3230.6678 3231.9058 3234.3118 3240.8158 3243.2902 3245.6983 3248.5355 3250.6913 3253.0388 3254.7544 3261.3158 3263.5907 3708.6685
redmass: 6.2240 6.1063 4.6204 5.3127 4.8234 4.6124 5.5755 5.8625 4.7960 4.8604 6.7480 4.5933 6.2632 5.8899 6.5806 6.0943 5.3911 6.9078 5.3951 8.7908 3.8478 3.8990 8.8904 5.1628 5.6305 5.0054 4.9722 10.0622 5.6872 13.0103 8.2633 7.3841 7.4176 4.1107 4.4551 3.2133 2.8946 3.5339 3.5017 1.4544 3.6181 4.1866 3.8628 2.8820 3.1945 3.4676 2.9082 9.3379 3.2326 6.6897 6.7492 5.3830 7.7797 7.8064 3.9129 6.5881 6.7067 6.8825 3.5654 4.0891 6.0352 7.0257 6.9287 6.7335 4.1581 2.0490 2.0451 1.2564 1.2248 3.7229 3.8013 1.2051 4.7412 4.7259 1.9189 6.2283 5.5282 2.5539 3.2129 1.6465 1.3441 1.4155 1.4156 15.1812 1.3234 1.3283 1.4156 1.5882 1.4350 3.8398 4.5664 1.3199 1.3060 1.3897 1.3844 1.3884 1.3856 1.3064 1.3052 1.3483 3.6440 1.5214 1.7207 4.0432 2.3834 2.3802 7.5471 6.3408 2.6435 2.6188 2.4866 2.0022 1.8546 1.6397 1.6874 1.4885 1.4964 1.6511 1.1090 1.1081 1.1145 1.1315 1.3845 1.4189 1.3516 2.1904 2.2084 1.6289 1.6539 1.7455 1.8136 2.1845 2.3333 4.0814 2.5050 1.1698 2.1913 3.1505 3.6958 3.8806 3.6585 1.7333 1.6321 6.9171 6.6194 2.3333 2.5543 2.1821 2.5570 2.1547 2.5021 1.9940 1.9807 2.8183 2.9756 3.1369 3.1545 5.8121 6.2038 6.2883 5.4579 6.1710 4.9671 5.1324 5.0919 5.3312 6.0604 6.0313 6.0155 1.0867 1.0868 1.0891 1.0892 1.0952 1.0951 1.0915 1.0924 1.0915 1.0984 1.0982 1.0899 1.0892 1.0917 1.0903 1.0898 1.0910 1.0944 1.0961 1.0978 1.0949 1.0980 1.0953 1.0937 1.0931 1.0686
irintensity: 0.3231 0.0321 0.2388 0.1222 0.9836 0.5533 4.4424 5.2509 0.8137 0.0288 7.6468 3.4746 0.6802 3.5715 3.5062 0.8071 0.0497 6.2500 2.2617 14.2147 2.0317 0.5219 4.3437 8.1852 5.5633 1.0636 2.8566 27.5162 3.6030 139.1786 23.2588 17.2185 33.0023 10.0340 1.8811 5.0091 19.5850 0.9681 17.7907 186.7445 79.4538 41.5110 7.7185 14.0690 4.0279 11.5519 26.8559 158.7458 7.6913 0.1569 0.8458 3.4762 2.5799 36.4744 0.3046 26.9685 10.4301 8.5604 11.6311 3.1356 0.0068 71.4956 26.1976 3.7810 34.4733 1.3234 1.0507 35.5707 41.4784 2.5468 1.8766 237.2107 2.0142 1.7068 1.3536 15.3835 16.9004 13.1502 15.6522 61.7006 83.0972 13.7171 13.7857 23.7594 0.2035 0.3804 0.0084 14.2337 7.6668 4.7085 17.6788 0.3099 1.1108 7.1889 5.9557 1.2180 1.3371 0.0246 0.0373 0.6652 6.2959 11.5933 0.4805 53.7845 15.5640 12.2068 49.3221 3.6304 159.6352 17.2781 7.7206 0.7723 25.6319 10.0285 10.8063 2.7766 2.8192 0.8388 7.2963 5.5997 3.3921 22.3822 25.8640 14.3086 17.4615 11.6813 14.3003 0.9094 2.5106 36.9572 21.7182 1.3101 34.2934 45.9543 21.1118 41.5874 68.7620 14.0055 15.9692 16.4285 13.9490 55.9553 48.5694 54.5419 55.0702 4.4090 9.4479 11.8835 6.3656 207.7814 6.9579 26.6711 7.5806 189.9787 30.1903 14.5654 19.7238 30.7881 3.0087 5.9908 24.6551 55.1085 94.5707 24.4854 28.1569 108.3155 1.1176 108.3522 100.2190 0.7343 0.7836 1.0006 1.4588 26.5285 26.1636 3.5040 5.1819 4.7483 29.7402 26.6180 8.8505 5.3969 1.5278 4.2773 2.8341 0.8042 0.1177 0.2588 4.1714 0.9327 8.4443 0.4490 13.8645 12.3636 120.5453
temp: 298.150 k
press: 1.00000 atm
elementType: 24 6 6 6 6 6 6 6 6 6 6 6 6 6 6 7 7 7 6 1 1 1 1 1 1 1 1 1 1 1 8 8 1 7 6 6 6 6 6 6 6 6 6 1 1 1 1 1 1 1 7 6 6 6 6 6 6 6 6 6 1 1 1 1 1 1 1
symmnumber: 1
zpe: 1377188.0 jmol-1
zpe.correction: 0.524543 hartree
zpe.thermalcorrener: 0.558284 hartree
zpe.thermalcorrenthalpy: 0.559228 hartree
zpe.thermalcorrgfe: 0.456879 hartree
zpe.sumelectzpe: -1783.130845 hartree
zpe.sumelectthermal: -1783.097104 hartree
zpe.sumelectthermalent: -1783.096160 hartree
zpe.sumelectthermalfe: -1783.198509 hartree
dipole: -2.2294 -0.2876 9.3208
dipole: 9.5880
quadrupole: -121.7796 -142.3847 -163.1765
quadrupole: 16.5049 4.1634 3.0147
quadrupole: 20.6673 0.0623 -20.7296 16.5049 4.1634 3.0147
hfenergy: -1783.6553885 hartree
pointgroup: C01 [X(C33H26Cr1N5O2)]
dipole: 3.6721753 0.6125095 -0.6079491 debye
polarizability: 699.3249663|0.7325938|675.3086429|-4.054196|-71.2626043|677.1179104 unknown
InChI: InChI=1S/C15H11N3.2C9H7N.Cr.H2O2/c1-3-10-16-12(6-1)14-8-5-9-15(18-14)13-7-2-4-11-17-13;2*1-2-4-9-7-10-6-5-8(9)3-1;;1-2/h1-11H;2*1-7H;;1-2H/q-3;2*-1;+6;/p-1
charge 2 multiplicity 4
67 atoms
Cr -0.09678982 -0.05334974 0.0570908
C  -0.19551564 4.30696202 -0.48996921
C  1.1589768 4.62779196 -0.57269173
C  2.11124499 3.61747791 -0.42755365
C  1.68246124 2.30833163 -0.20981295
C  2.58798781 1.15968604 -0.01666196
C  3.98442951 1.20413861 0.02176422
C  4.67901174 0.01559855 0.2541225
C  3.9920477 -1.18692567 0.43260836
C  2.59582014 -1.17107074 0.36976665
C  1.70174033 -2.34126697 0.47332812
C  2.13287387 -3.64490491 0.71845658
C  1.19097901 -4.67442821 0.76066168
C  -0.1561881 -4.3799502 0.55292399
C  -0.52521531 -3.05670844 0.32030994
N  0.37839769 -2.06246444 0.2844426
N  1.93838459 -0.01047257 0.15663761
N  0.3550205 2.0017151 -0.13832014
C  -0.55799855 2.97889341 -0.27249901
H  -0.96532151 5.06275436 -0.58998491
H  1.47578342 5.65071305 -0.74377641
H  3.16879234 3.84495423 -0.48074602
H  4.51749018 2.13588005 -0.12175217
H  5.76252837 0.02504683 0.29263164
H  4.53323054 -2.10892199 0.60422359
H  3.18389926 -3.85528834 0.87334534
H  1.51086876 -5.6931344 0.95031536
H  -0.91549781 -5.15251491 0.57095958
H  -1.55742072 -2.76590507 0.1584411
H  -1.59532183 2.67564808 -0.19337817
O  -1.96088248 -0.45398351 -0.06872463
O  -2.77693263 0.62681221 0.48533309
H  -3.16812615 1.00516919 -0.32406322
N  -0.22303478 0.10492856 2.14835214
C  0.6171292 0.90232339 2.88864456
C  0.54122276 0.98647607 4.25621294
C  -0.43019536 0.23034833 4.96257191
C  -0.57618856 0.25772267 6.37308594
C  -1.55152114 -0.5108274 6.97722305
C  -2.41703631 -1.33325958 6.2090107
C  -2.29943937 -1.38042421 4.83621377
C  -1.30345378 -0.59937557 4.18950753
C  -1.1462942 -0.61529087 2.78512409
H  1.35144341 1.47581694 2.33949453
H  1.22719698 1.6340162 4.79195528
H  0.08398558 0.88634743 6.96254674
H  -1.662978 -0.48879959 8.05688267
H  -3.17436715 -1.92600091 6.71174165
H  -2.9552771 -2.00421211 4.23630271
H  -1.79877287 -1.22537773 2.16997648
N  0.02556935 -0.18513705 -2.04144836
C  1.01632773 -0.84165111 -2.72919045
C  1.06518698 -0.8688494 -4.10086718
C  0.07295572 -0.1962757 -4.8613956
C  0.05124198 -0.17266379 -6.27957929
C  -0.95282805 0.50752735 -6.93988608
C  -1.97151656 1.18822978 -6.22259404
C  -1.97783628 1.18275608 -4.84414163
C  -0.9556529 0.49019837 -4.14014406
C  -0.92035844 0.45386827 -2.72820762
H  1.7650582 -1.3477407 -2.13416371
H  1.86520048 -1.40622176 -4.59892103
H  0.82885637 -0.69319065 -6.82989995
H  -0.96867749 0.52429007 -8.02528482
H  -2.74818296 1.71333601 -6.76908939
H  -2.75186776 1.69817922 -4.28344654
H  -1.68973792 0.9573093 -2.15202052
