program: Gaussian 09
title: 000032441
version: EM64L-G09RevD.01
frameworkgroup: C1[X(C14H19Cl6N3)]
method: RPBEPBE
basis: SDD
operation: Freq
keyword: #p
keyword: freq=noraman
keyword: PBEPBE/SDD
title: #p freq=noraman PBEPBE/SDD
converged: YES YES NO NO
title: Mulliken charges:
elementType: Cl Cl Cl Cl Cl Cl N N N C C C C C C C C C C C C C C H H H H H H H H H H H H H H H H H H H
charge: 0.113205 0.155232 0.121652 0.112125 0.156579 0.120106 0.057187 0.066069 0.059912 -0.371025 -0.383129 -0.379431 -0.372449 -0.393553 -0.353190 -0.506500 -0.356720 0.059432 -0.695774 0.244220 0.235386 -0.790809 -0.793811 0.195962 0.191516 0.193343 0.193613 0.201904 0.199581 0.190592 0.189771 0.217692 0.234444 0.188332 0.188702 0.245318 0.238787 0.194752 0.195358 0.210197 0.215699 0.209723
chargesum: 0.00000
title: Mulliken charges with hydrogens summed into heavy atoms:
elementType: Cl Cl Cl Cl Cl Cl N N N C C C C C C C C C C C C C C
charge: 0.113205 0.155232 0.121652 0.112125 0.156579 0.120106 0.057187 0.066069 0.059912 0.016454 0.003827 0.022053 0.007914 0.058582 0.023844 -0.022394 0.033390 0.059432 -0.060155 0.244220 0.235386 -0.790809 -0.793811
polarizability: 2.54896101e+02 -3.03574106e+00 2.26487634e+02 -9.34811358e+00 1.53718149e+00 2.16696908e+02
1716.lowfreq: -12.2719 -6.0378 -4.2281 -0.0019 -0.0012 0.0016 3.5431 9.0942 10.8803
frequency: -6.8441 8.8307 10.4465 11.7984 27.5689 33.8730 46.2530 71.3263 79.2384 79.9888 85.8491 91.6890 121.7058 126.4610 136.0136 142.9469 158.2808 162.9555 176.9037 210.6525 214.3120 218.7876 230.8968 235.6302 251.4224 265.1376 277.3641 278.7688 305.1225 314.6281 335.6505 378.4604 386.8304 407.2389 442.8395 471.8991 501.1336 550.2173 610.5370 638.9997 658.1219 707.5792 719.2360 723.9268 732.8832 749.3424 757.6815 778.0826 780.3482 793.6942 839.8102 862.0219 877.4667 887.5853 913.7535 920.9259 954.3367 980.7400 997.2831 998.2197 1013.5568 1039.6006 1050.3654 1070.3918 1078.7274 1080.0243 1106.3101 1118.1629 1156.8701 1187.6412 1196.5312 1221.6397 1226.9491 1255.1531 1263.2567 1274.4202 1280.5513 1283.7626 1290.6447 1293.0824 1297.7056 1303.1329 1321.1887 1329.7083 1347.5987 1351.7075 1354.7291 1382.0257 1388.4775 1438.0387 1451.6433 1457.7070 1458.8204 1461.0320 1463.4647 1469.0367 1473.8796 1477.1455 1478.0160 1483.6856 1487.9377 2949.6593 2950.7897 2952.8879 2956.5293 2962.9995 2968.0615 2971.8632 2984.1154 2987.2770 2990.1502 2999.0044 2999.4855 3012.1829 3026.7660 3039.6630 3054.9179 3068.5966 3071.4682 3085.6642
redmass: 7.7789 5.4381 28.8001 25.5606 1.5908 4.1068 4.1370 7.9756 8.9492 1.6136 17.7690 4.5632 3.1379 1.9241 4.8773 2.5205 30.8430 6.6876 4.3114 5.6626 16.0297 10.6233 8.1602 1.0952 23.6005 5.4411 3.3536 19.9413 11.0775 8.3157 5.5454 19.4277 7.6820 4.2748 3.6025 3.6919 4.2058 5.2859 13.5031 5.2849 12.3681 3.0587 1.0769 1.3029 1.9756 2.3077 3.2689 7.6403 12.1493 1.5329 2.1885 1.8929 2.9129 1.9046 13.6648 1.6812 2.3396 3.7583 3.0237 4.9247 1.3951 2.9792 2.8688 2.5558 2.2583 2.2516 2.0480 2.3227 2.7076 1.7708 1.7842 1.4767 1.3700 1.4393 1.3536 1.9511 1.0319 1.3289 1.0896 1.2796 1.5802 2.4102 1.9350 1.4047 1.5509 1.6668 1.6539 4.1952 1.2162 2.3802 1.7564 1.1249 1.0812 1.1582 1.1095 1.3131 1.8826 1.0434 1.2340 1.1054 1.0892 1.0587 1.0588 1.0593 1.0594 1.0591 1.0587 1.0363 1.0965 1.0609 1.0976 1.0719 1.0914 1.1033 1.1046 1.1047 1.1039 1.1008 1.0993 1.0978
irintensity: 0.0050 0.1570 0.0876 0.0441 0.0052 0.0378 0.0005 0.0176 0.0815 0.0260 0.0638 0.0531 0.6399 0.0298 0.1216 0.1957 0.3276 0.3982 0.1821 0.7432 0.0988 0.0905 0.1883 0.0007 0.3304 0.4593 0.2588 0.0469 0.5958 1.9857 0.3654 0.0006 0.3438 1.4168 1.1273 7.3285 5.5737 19.8204 0.3006 138.2622 94.2046 137.6958 24.4544 33.3227 119.0799 79.6293 9.7551 16.9996 0.1169 12.0135 7.8178 0.6908 3.1654 3.8350 1.5919 10.4598 22.8376 13.7066 3.9390 4.2003 7.0555 0.7651 5.0453 8.9093 0.5832 0.3998 16.6419 5.7732 15.0451 2.7422 2.7576 1.2570 13.4157 2.3064 4.3479 12.2041 0.8188 15.6995 0.4441 9.8106 8.7533 28.0209 14.4855 3.7078 4.6550 0.2692 3.8668 10.5802 11.2585 193.8146 78.4530 6.6284 1.3630 18.9578 6.0155 52.6197 147.1961 9.9385 59.0575 16.9182 31.2006 0.1425 1.2694 1.0495 0.7177 36.3352 156.6486 37.6637 0.0244 43.7671 1.3598 14.7707 4.8356 3.3808 0.2283 119.4891 73.4815 95.8321 55.0771 19.4912
temp: 298.150 k
press: 1.00000 atm
elementType: 17 17 17 17 17 17 7 7 7 6 6 6 6 6 6 6 6 6 6 6 6 6 6 1 1 1 1 1 1 1 1 1 1 1 1 1 1 1 1 1 1 1
symmnumber: 1
zpe: 813030.6 jmol-1
zpe.correction: 0.309667 hartree
zpe.thermalcorrener: 0.336153 hartree
zpe.thermalcorrenthalpy: 0.337098 hartree
zpe.thermalcorrgfe: 0.245720 hartree
zpe.sumelectzpe: -3467.684654 hartree
zpe.sumelectthermal: -3467.658167 hartree
zpe.sumelectthermalent: -3467.657223 hartree
zpe.sumelectthermalfe: -3467.748600 hartree
dipole: -2.3345 0.0547 2.2139
dipole: 3.2177
quadrupole: -180.6055 -190.9105 -173.3252
quadrupole: 0.9943 0.3286 -0.3315
quadrupole: 1.0082 -9.2968 8.2885 0.9943 0.3286 -0.3315
hfenergy: -3467.9943208 hartree
pointgroup: C01[X(C14H19Cl6N3)]
dipole: -0.8624187 -0.5721169 -0.7290838 debye
polarizability: 252.4598269|11.156028|228.3224858|6.1790771|-2.5681113|217.2983306 unknown
InChI: InChI=1S/C14H19Cl6N3/c1-2-3-4-5-6-7-8-9-10-21-11(13(15,16)17)23-12(22-10)14(18,19)20/h2-9H2,1H3
charge 0 multiplicity 1
42 atoms
Cl 1.31654 3.87209 -0.63887
Cl 4.032906 3.446396 0.611058
Cl 3.704743 3.148303 -2.369541
Cl 4.259646 -2.705265 1.114925
Cl 3.818601 -0.450476 3.077205
Cl 1.558137 -2.341088 2.453829
N  1.851313 -1.227589 -0.393589
N  1.765281 0.871275 -1.579405
N  2.958737 0.716372 0.519334
C  -2.982859 -1.355025 -0.888168
C  -3.995046 -0.327118 -0.333315
C  -1.68539 -0.706295 -1.419938
C  -5.284441 -0.977378 0.216901
C  -0.685472 -1.746858 -1.971407
C  -6.298641 0.049523 0.770093
C  0.621648 -1.113363 -2.528971
C  -7.583871 -0.600936 1.33112
C  1.447092 -0.45779 -1.458075
C  -8.59082 0.432709 1.881183
C  2.581538 -0.592973 0.555414
C  2.524405 1.392277 -0.578417
C  2.895278 2.875147 -0.715119
C  3.030753 -1.446723 1.748936
H  -2.726517 -2.084184 -0.091631
H  -3.462445 -1.93867 -1.701754
H  -3.511683 0.264791 0.471835
H  -4.261063 0.395538 -1.13279
H  -1.210778 -0.124847 -0.602088
H  -1.936292 0.025632 -2.215106
H  -5.017557 -1.697022 1.019039
H  -5.767567 -1.572744 -0.586107
H  -1.162769 -2.319627 -2.789849
H  -0.418997 -2.472063 -1.179169
H  -6.572624 0.765593 -0.032864
H  -5.81467 0.649713 1.568905
H  0.398577 -0.361781 -3.304383
H  1.234833 -1.914576 -2.986951
H  -8.066829 -1.201086 0.53299
H  -7.308913 -1.315602 2.133618
H  -8.14129 1.026142 2.699711
H  -9.499601 -0.05632 2.27782
H  -8.904991 1.1391 1.089594
