program: Gaussian 09
title: /home/michael/molsimp_comfiles/Mn_41a_1_VAC/Mn_41a_1_VAC.com auto generated
version: ES64L-G09RevE.01
frameworkgroup: C1[X(C28H18MnN6)]
method: UTPSSh
basis: Gen
operation: Freq
keyword: #PGeom=AllCheck
keyword: Guess=TCheck
keyword: SCRF=Check
keyword: GenChk
keyword: UTPSSh/ChkBas
keyword: Freq
title: /home/michael/molsimp_comfiles/Mn_41a_1_VAC/Mn_41a_1_VAC.com auto gene
converged: YES YES NO NO
polarizability: 4.35916502e+02 -9.77587795e+01 1.01767499e+03 -7.28320960e+01 -6.76813036e+00 9.03465561e+02
1716.lowfreq: -12.0364 0.0003 0.0008 0.0008 8.9041 9.8949 13.7416 25.3411 31.1320
frequency: -5.4449 20.1466 27.6035 55.1220 60.4724 79.1511 80.2640 81.6395 131.4901 140.2939 147.1421 173.1107 181.6453 189.6239 199.6643 206.2135 216.6877 227.0262 235.3975 240.8710 250.4774 300.9249 330.3236 331.8993 339.2396 359.6064 377.3136 380.2100 380.6786 384.6960 398.5450 413.8617 442.7702 443.9803 476.7856 479.9435 485.7377 529.9060 532.2273 637.0934 662.3259 675.1435 677.9262 678.3661 689.4032 699.6991 710.1058 711.0527 717.1182 727.8420 728.8161 738.1711 738.5162 764.5399 781.0044 781.7616 791.1767 791.4303 794.1803 794.5561 794.6161 797.9401 801.2648 818.7063 837.2149 864.6242 865.4980 869.0287 869.4846 875.2095 892.6176 912.0758 914.9977 915.7197 919.0942 973.5784 986.0940 998.7340 999.1458 1002.0621 1005.1539 1017.6886 1018.2602 1019.8880 1031.9302 1032.7391 1034.4178 1056.1396 1074.7448 1074.9672 1078.4546 1081.7668 1088.6113 1154.6862 1167.8753 1178.2253 1178.5899 1180.9592 1182.4175 1197.6806 1204.6559 1234.0119 1270.5214 1271.2513 1283.0565 1305.2311 1327.2581 1327.5524 1328.5834 1355.9063 1372.3771 1376.6332 1381.9946 1408.4116 1409.0423 1410.2042 1436.5151 1448.4672 1451.1070 1459.4160 1459.5250 1484.3902 1491.4410 1525.6552 1537.9482 1545.4531 1545.9128 1571.8084 1572.7293 1573.0276 1585.6619 1587.1297 1621.9510 1625.9810 1664.1658 3195.9990 3196.1816 3196.4354 3197.4828 3206.1047 3213.1523 3221.3262 3222.4471 3229.0377 3238.1027 3239.1310 3239.3071 3239.4872 3239.6062 3258.0857 3258.2907 3258.4278 3258.8044
redmass: 4.4673 5.9530 5.7949 5.7909 5.2637 6.3553 5.1325 6.3705 7.3594 5.5783 5.3043 4.1303 8.9254 8.1857 6.2004 8.0956 9.2076 6.7977 8.6758 14.5641 13.4766 4.8523 5.7070 5.6429 4.9742 5.2892 4.6348 6.1704 3.6350 6.5320 4.8731 4.2602 3.9167 3.9176 3.1678 3.5438 3.9608 7.3219 7.6593 7.3616 4.5606 3.4570 3.8125 3.8359 5.3424 3.6992 3.6562 3.6288 3.3380 6.2726 4.3554 4.6011 4.5962 1.2855 4.0656 1.5862 1.9044 1.8214 6.5375 3.7994 3.6435 3.7327 1.5957 5.2644 5.9203 1.3272 1.3014 1.3553 1.3485 1.4385 1.5198 1.3120 1.3366 1.3319 1.3460 5.3204 1.3241 6.7409 1.3646 8.5263 8.5354 6.4290 2.9020 1.3089 3.2855 3.2705 2.3119 5.6281 1.1638 1.1657 1.1180 1.1718 2.9938 1.4935 1.2839 1.7516 1.7532 1.6591 1.4484 2.2735 1.9176 2.8485 3.2341 3.2193 1.8249 2.5195 3.8258 3.8361 2.8852 3.7356 10.9407 1.6531 5.2108 2.8169 2.8478 2.4693 6.8650 8.6131 1.9819 4.4185 4.4165 2.3473 5.0609 4.9665 3.0787 6.2600 6.2628 6.0172 5.0193 4.9840 6.7270 5.3513 5.7773 6.7178 5.7904 1.0891 1.0890 1.0890 1.0890 1.0869 1.0890 1.0956 1.0901 1.0987 1.0977 1.0892 1.0892 1.0892 1.0893 1.1050 1.1050 1.1050 1.1049
irintensity: 3.9982 0.4232 1.0609 4.5473 0.0086 1.0278 0.0374 1.5546 6.6267 1.7862 1.3568 10.1639 9.7892 14.5913 1.4475 54.1453 37.8389 3.1549 4.4908 6.8250 6.9984 0.0003 18.8428 17.2271 9.7108 35.0341 12.0467 51.3756 3.4794 52.8943 0.2735 0.0004 0.1048 0.1516 10.1955 0.4146 0.0108 5.2029 3.5930 5.9795 1.6706 0.0412 0.1840 0.1086 0.0053 0.0297 0.0688 0.2347 13.2949 0.0285 0.1720 100.1066 99.4499 57.9546 68.2115 131.4751 6.2139 4.7850 0.1658 5.3653 4.6601 4.8185 0.0048 0.0070 11.5877 72.6761 0.9192 8.8425 1.6428 249.7439 7.6544 0.2973 0.8933 0.9341 0.0716 3.6218 1.9835 6.8854 0.8270 210.0584 214.4164 1.1544 0.5896 0.0025 0.5395 1.1318 7.8691 0.0306 101.8725 106.2765 1.0477 2.0792 15.3519 5.6189 18.7956 47.3635 48.7185 0.4020 7.1253 0.0386 0.0031 32.2023 3.5835 3.8095 0.6415 22.8062 14.4421 15.5046 6.5660 0.0134 5.0530 0.0038 0.0051 44.8848 46.8261 2.0236 49.7459 2.4105 10.9805 6.0043 5.5951 24.8016 0.0393 0.0327 12.6399 78.2880 80.6118 3.4175 72.6065 71.6734 2.0078 0.0267 48.2670 0.0173 4.2954 20.6893 34.1824 14.2068 20.8760 0.1728 3.0334 22.5849 0.9604 21.0343 5.1748 6.9951 7.2509 7.5950 6.9974 29.9539 74.6079 54.3508 8.2480
temp: 298.150 k
press: 1.00000 atm
elementType: 25 6 6 6 6 6 6 6 6 7 6 6 6 6 6 7 6 6 6 6 6 7 6 6 7 1 1 1 1 1 1 1 1 1 1 1 1 7 6 6 6 6 6 6 6 6 7 1 1 1 1 1 1
symmnumber: 1
zpe: 1040441.3 jmol-1
zpe.correction: 0.396283 hartree
zpe.thermalcorrener: 0.421834 hartree
zpe.thermalcorrenthalpy: 0.422779 hartree
zpe.thermalcorrgfe: 0.339651 hartree
zpe.sumelectzpe: -1510.074356 hartree
zpe.sumelectthermal: -1510.048805 hartree
zpe.sumelectthermalent: -1510.047861 hartree
zpe.sumelectthermalfe: -1510.130988 hartree
dipole: -10.8217 -4.1534 -0.9635
dipole: 11.6313
quadrupole: -168.7374 -166.9256 -184.4142
quadrupole: 4.1643 -0.6705 0.9983
quadrupole: 4.6217 6.4334 -11.0551 4.1643 -0.6705 0.9983
hfenergy: -1510.4706392 hartree
pointgroup: C01 [X(C28H18Mn1N6)]
dipole: -4.2580902 -1.6347018 -0.3703846 debye
polarizability: 435.7804192|-97.9240469|1017.6566059|-72.1558494|-7.0687725|903.620024 unknown
InChI: InChI=1S/C20H12N4.C8H6N2.Mn/c1-2-14-10-16-5-6-18(23-16)12-20-8-7-19(24-20)11-17-4-3-15(22-17)9-13(1)21-14;1-2-4-8-7(3-1)5-6-9-10-8;/h1-12H;1-6H;/q-4;;+4
charge 0 multiplicity 6
53 atoms
Mn 0.86449085 0.08968772 0.05341334
C  1.74764091 2.48396402 -3.52247806
C  1.51294435 3.50362024 -2.63905466
C  1.33600121 2.89838515 -1.33376523
C  1.11310296 3.59414906 -0.13264536
C  1.01263719 3.05562019 1.16211959
C  0.86616607 3.81810582 2.38613484
C  0.85111896 2.91721102 3.41747935
C  0.98818521 1.59965953 2.82821566
N  1.07544726 1.71696947 1.46223048
C  1.05630537 0.3882622 3.53950454
C  1.26601395 -0.9021879 3.02140944
C  1.39646007 -2.11554052 3.80400296
C  1.62649385 -3.13680623 2.92075511
C  1.63981116 -2.5520627 1.5944706
N  1.41132381 -1.2008784 1.68821527
C  1.88202554 -3.24397654 0.39433642
C  1.97241826 -2.70424388 -0.90119494
C  2.28658506 -3.4477213 -2.10527934
C  2.305864 -2.54660153 -3.13637295
C  2.00304078 -1.24806909 -2.56720324
N  1.80233058 -1.37697188 -1.21396549
C  1.94862003 -0.03586445 -3.27750571
C  1.71634674 1.25105127 -2.76082006
N  1.45595998 1.53393187 -1.44195943
H  1.93914804 2.55443886 -4.58600291
H  1.47551387 4.56648484 -2.84305621
H  1.04623216 4.67597184 -0.20974411
H  0.79949359 4.89746513 2.44345882
H  0.76989637 3.12003748 4.47813523
H  0.96914938 0.46211173 4.6201533
H  1.33212799 -2.17049103 4.88363928
H  1.78700869 -4.18481979 3.14131827
H  2.04647991 -4.3145715 0.48137345
H  2.4777964 -4.51281156 -2.14761794
H  2.51518006 -2.73482971 -4.18208304
H  2.1383285 -0.09702076 -4.34568775
N  -1.41559407 -0.54624034 -0.18601745
C  -1.83384506 -1.8402651 -0.25251184
C  -3.16680416 -2.18656481 -0.33240201
C  -4.12222262 -1.1519772 -0.34449036
C  -5.52708534 -1.35233225 -0.42036141
C  -6.37172022 -0.26398435 -0.42296246
C  -5.8584863 1.06162133 -0.35101325
C  -4.5032703 1.28930079 -0.27725434
C  -3.60881564 0.18396488 -0.27253315
N  -2.27254566 0.45029973 -0.19587961
H  -1.03973673 -2.57804663 -0.23677728
H  -3.46842698 -3.22754095 -0.38369427
H  -5.9130669 -2.36536864 -0.47467778
H  -7.44537296 -0.41235192 -0.48018465
H  -6.54965254 1.89830157 -0.3544504
H  -4.09434364 2.29292523 -0.22131927
