program: Gaussian 09
title: /home/michael/molsimp_comfiles/Mn_3a1_5_VAC/Mn_3a1_5_VAC.com auto generated
version: ES64L-G09RevE.01
frameworkgroup: C1[X(C29H23MnN5)]
method: UTPSSh
basis: Gen
operation: Freq
keyword: #P
keyword: Geom=AllCheck
keyword: Guess=TCheck
keyword: SCRF=Check
keyword: GenChk
keyword: UTPSSh/ChkBas
keyword: Freq
title: /home/michael/molsimp_comfiles/Mn_3a1_5_VAC/Mn_3a1_5_VAC.com auto gene
converged: YES YES NO YES
polarizability: 6.22075074e+02 4.97347145e+00 6.15305290e+02 8.83544299e+01 -3.77568215e+01 3.84217212e+02
1716.lowfreq: -8.2797 -0.0008 -0.0007 -0.0005 3.0759 16.2791 16.8338 19.4710 25.8700
frequency: 10.5349 19.1682 21.9149 28.3330 32.5269 36.7507 49.0026 61.1930 77.3853 85.9113 94.4448 99.8890 111.2804 117.5252 124.8715 138.8611 150.6710 178.1826 181.3864 201.5254 210.6975 216.1727 226.7320 244.1787 258.5636 302.2373 357.5049 363.2080 387.9933 388.5663 409.9084 416.2865 424.6777 426.2491 432.1610 452.7159 471.0772 486.0255 520.2095 522.2208 524.2389 527.7480 626.0224 627.2091 638.5554 640.2035 644.8419 648.2421 652.9473 655.2207 657.4823 712.0611 729.0103 741.2700 751.9316 761.6198 763.6099 768.5040 782.4230 783.2842 787.0583 807.3602 820.5035 838.8281 841.3583 850.6343 890.7643 903.3542 912.9988 921.2203 937.1486 954.8224 960.1264 973.4753 979.3696 988.2880 990.6584 993.6469 1007.0214 1017.5001 1018.6761 1020.1929 1023.1265 1025.0582 1026.3213 1026.9412 1027.6550 1031.5605 1040.3131 1046.7356 1051.8705 1064.1005 1077.1073 1090.7207 1096.8396 1099.2211 1119.7578 1129.3243 1144.5997 1157.9701 1159.5461 1171.9953 1175.9075 1182.2418 1192.1379 1199.7353 1224.8373 1238.6411 1250.1936 1281.9021 1300.5696 1308.4004 1318.1004 1326.1416 1326.5811 1330.9578 1338.5992 1358.0416 1365.2699 1378.1941 1393.0093 1418.4001 1431.4188 1436.3370 1471.1574 1475.9431 1481.0131 1486.7673 1493.1486 1495.6986 1515.0547 1525.3205 1532.9709 1543.8546 1608.8014 1610.7712 1620.5392 1624.3848 1625.4808 1639.0981 1639.6797 1643.6389 1648.3163 1652.2704 1673.2968 3200.7570 3203.1059 3206.5097 3214.1541 3214.9401 3216.0742 3216.1376 3216.4054 3218.9862 3222.4028 3222.5777 3223.9334 3224.4783 3226.1784 3235.9229 3236.5000 3239.3479 3239.5915 3241.0608 3243.5095 3245.1495 3252.1275 3253.9812
redmass: 4.5757 5.6468 5.6251 5.6189 4.1632 5.0867 5.1480 5.7960 5.0794 4.4257 4.7206 5.9821 5.9989 5.8130 5.1171 5.1640 6.4186 5.4616 6.1671 7.3759 8.3746 6.4396 5.9658 5.8941 5.9398 6.5496 6.5025 4.1846 3.1065 2.6700 3.4907 3.6288 4.5383 4.4366 4.5956 3.7193 3.4017 2.8723 3.1945 6.6040 7.5584 5.5199 6.9052 7.4466 6.9748 6.4238 3.7812 3.7606 7.2495 6.3380 7.0875 1.6998 6.6865 2.2388 3.2915 1.9156 1.2194 1.8255 3.0083 1.3322 4.7123 2.2497 6.1718 5.8926 2.4910 1.3564 1.3992 1.2435 1.3280 1.2991 1.3935 1.5335 4.0182 1.3011 1.3196 1.3967 1.3863 1.3952 1.4326 1.2986 5.2736 1.4436 7.4563 7.3630 7.3453 1.3218 1.3217 1.3077 2.4040 5.6516 6.2284 2.5460 2.5836 1.6959 1.9932 1.7648 1.7342 1.6038 1.6456 1.4912 1.7513 1.0827 1.1191 1.1364 1.1983 1.4459 1.3159 1.2489 2.1781 1.6786 1.8929 2.4940 2.4680 6.2444 2.8307 2.7578 2.7694 3.2351 4.6271 3.8189 1.2106 1.6228 7.0415 2.2538 2.1775 2.3767 2.2126 2.0154 2.8123 1.9899 2.3869 1.9033 2.6515 3.1974 6.1284 5.7112 5.4999 5.2592 6.3471 4.5169 4.9976 5.2198 5.9886 5.0660 5.9424 1.0864 1.0915 1.0890 1.0899 1.0878 1.0914 1.0893 1.0930 1.0893 1.0905 1.0908 1.0904 1.0985 1.0916 1.0958 1.0967 1.0953 1.0960 1.1000 1.0968 1.0972 1.0925 1.0945
irintensity: 0.0123 0.1822 0.0892 0.0885 0.0752 0.6760 0.5005 2.5399 0.0341 0.8444 2.2475 2.3397 2.2749 3.0798 3.2098 1.0688 15.8218 27.1172 22.9752 50.4142 49.9229 29.2639 26.9625 17.8080 2.6015 15.3166 1.7198 0.0088 1.5623 0.0655 12.3211 2.3866 14.1610 5.8500 17.1475 0.1227 0.4226 37.5993 9.9001 0.5221 8.6817 2.3740 14.3736 3.5295 38.3662 17.0944 0.3164 8.7303 27.2480 1.5734 21.4112 96.0520 0.3635 17.2680 7.5189 0.3613 37.8361 28.6259 24.0796 222.1424 0.6734 0.1664 16.3866 0.2065 3.4517 82.4315 11.3184 0.0118 0.5560 0.2338 0.0220 7.8208 18.8371 0.9900 0.8121 0.8217 3.9194 3.3459 0.0633 0.0107 0.8115 0.5010 48.8194 37.1443 42.4132 0.2237 0.3492 0.0085 13.2331 4.9710 1.5066 58.3555 8.3223 32.4059 4.8553 0.6171 11.0381 3.3588 6.0313 3.1454 2.8532 3.6161 4.7598 10.1320 24.6778 13.4232 25.9438 13.2356 8.2002 2.8671 21.1569 0.8154 43.1645 7.7806 10.0175 2.4822 65.8759 2.0416 26.6192 0.5788 2.0131 34.3615 45.0533 7.4091 63.2822 7.9502 76.9185 185.3629 24.5149 19.3721 137.5986 3.9010 11.2517 21.2202 9.2027 39.6714 56.8001 6.0630 83.7997 72.4195 51.0362 124.8028 3.7912 69.3419 92.5741 0.6453 11.2400 3.0325 9.3028 2.8539 20.2311 7.8939 15.2151 9.0681 2.6262 7.2261 13.2055 28.7915 4.0266 23.2312 17.0041 8.8767 10.6719 3.5286 2.5677 0.1758 4.1892 4.5672
temp: 298.150 k
press: 1.00000 atm
elementType: 25 6 6 6 6 6 6 6 6 6 6 6 6 6 6 7 7 7 6 1 1 1 1 1 1 1 1 1 1 1 7 6 6 6 6 6 6 6 6 6 1 1 1 1 1 1 1 7 6 6 6 6 6 1 1 1 1 1
symmnumber: 1
zpe: 1202232.6 jmol-1
zpe.correction: 0.457906 hartree
zpe.thermalcorrener: 0.487299 hartree
zpe.thermalcorrenthalpy: 0.488244 hartree
zpe.thermalcorrgfe: 0.391393 hartree
zpe.sumelectzpe: -1496.166764 hartree
zpe.sumelectthermal: -1496.137371 hartree
zpe.sumelectthermalent: -1496.136427 hartree
zpe.sumelectthermalfe: -1496.233278 hartree
dipole: 4.7038 0.0128 -0.7079
dipole: 4.7568
quadrupole: -92.6209 -114.4808 -159.5975
quadrupole: 3.4282 11.8801 -2.9155
quadrupole: 29.6122 7.7523 -37.3644 3.4282 11.8801 -2.9155
hfenergy: -1496.6246704 hartree
pointgroup: C01 [X(C29H23Mn1N5)]
dipole: -1.8310879 -0.1268561 0.3652729 debye
polarizability: 536.0529778|16.3348773|615.8115087|-145.4585196|28.6242681|469.7330895 unknown
InChI: InChI=1S/C15H11N3.C9H7N.C5H5N.Mn/c1-3-10-16-12(6-1)14-8-5-9-15(18-14)13-7-2-4-11-17-13;1-2-4-9-7-10-6-5-8(9)3-1;1-2-4-6-5-3-1;/h1-11H;1-7H;1-5H;
charge 2 multiplicity 6
58 atoms
Mn -0.1129904 -0.07627308 0.16227508
C  0.03274954 -4.63916386 0.29111476
C  -0.84311166 -4.96938513 1.32524113
C  -1.51531234 -3.95208321 2.00301508
C  -1.2929253 -2.62167268 1.62968007
C  -1.97093542 -1.47247946 2.28528681
C  -2.91629558 -1.61866111 3.30837266
C  -3.49426088 -0.47287619 3.85150395
C  -3.12869549 0.78406634 3.37378853
C  -2.17769038 0.86144291 2.34863326
C  -1.71134415 2.14494193 1.76237586
C  -2.19216865 3.39339177 2.17427957
C  -1.70075718 4.54633213 1.56124158
C  -0.74236885 4.43017065 0.55443133
C  -0.30896589 3.15335044 0.20067367
N  -0.77830598 2.03945103 0.78625049
N  -1.62263628 -0.25232382 1.82800629
N  -0.43569104 -2.30697456 0.62821451
C  0.20627953 -3.29203003 -0.02178948
H  0.57233913 -5.39972239 -0.26130039
H  -1.00452573 -6.00520044 1.60443745
H  -2.19704279 -4.1976181 2.80811815
H  -3.19979387 -2.59711025 3.67483713
H  -4.22788244 -0.55921057 4.64563865
H  -3.57431446 1.67680388 3.79414132
H  -2.93604861 3.47282406 2.95758401
H  -2.06448567 5.52092755 1.86926156
H  -0.33553759 5.30105273 0.05343748
H  0.43849806 3.00871325 -0.57296138
H  0.87792942 -2.97996309 -0.81541747
N  2.09860843 0.33828172 -0.09435558
C  2.79860062 1.28564926 0.60939094
C  4.11922153 1.5699452 0.35793707
C  4.81010621 0.87182755 -0.66827689
C  6.17017591 1.1070133 -1.00018595
C  6.76638427 0.38598355 -2.01555666
C  6.04054669 -0.59573623 -2.74031991
C  4.71849575 -0.84753646 -2.44093368
C  4.08057042 -0.11862825 -1.4012745
C  2.7242269 -0.33200708 -1.05904244
H  2.24386358 1.8026838 1.38393587
H  4.63206852 2.32864533 0.94007142
H  6.72793945 1.85720122 -0.44793626
H  7.80642123 0.56874056 -2.26813554
H  6.53494565 -1.14724385 -3.533685
H  4.15123762 -1.59520814 -2.98765552
H  2.14144352 -1.07286792 -1.60020938
N  -1.71629953 -0.09842311 -1.47351335
C  -1.63762166 0.83387438 -2.44743459
C  -2.6311212 1.00499782 -3.40801969
C  -3.75826882 0.18171884 -3.36200517
C  -3.84611005 -0.78404925 -2.35724706
C  -2.80727516 -0.891408 -1.43580762
H  -0.74822174 1.45594968 -2.44415278
H  -2.51912139 1.76831934 -4.16989218
H  -4.55255199 0.29111626 -4.09338961
H  -4.70278955 -1.44448827 -2.28189698
H  -2.84178428 -1.62737198 -0.63958062
