program: Gaussian 09
title: /home/michael/molsimp_comfiles/Ru_31a_5_VAC/Ru_31a_5_VAC.com auto generated
version: ES64L-G09RevE.01
frameworkgroup: C1[X(C29H23N5Ru)]
method: UTPSSh
basis: Gen
operation: Freq
keyword: #P
keyword: Geom=AllCheck
keyword: Guess=TCheck
keyword: SCRF=Check
keyword: GenChk
keyword: UTPSSh/ChkBas
keyword: Freq
title: /home/michael/molsimp_comfiles/Ru_31a_5_VAC/Ru_31a_5_VAC.com auto gene
converged: YES YES NO YES
polarizability: 8.22277791e+02 1.15135944e+01 6.95704325e+02 -2.73150649e+01 4.10813135e+01 4.35749091e+02
1716.lowfreq: -8.4636 0.0005 0.0009 0.0009 10.8844 17.4127 24.8534 29.1343 33.3526
frequency: 24.0155 28.4960 33.2633 41.9602 49.8448 56.5515 73.6432 91.3686 110.0975 116.1997 122.9971 127.5653 144.1693 169.1615 175.1607 194.3109 215.6282 220.1737 234.8596 249.5767 253.4997 295.0293 303.9926 317.8627 318.9717 350.1219 361.9282 378.8024 397.5680 405.8875 429.0317 453.0471 456.2208 464.6703 471.6269 481.2897 491.8641 500.7810 522.7871 529.0617 538.2481 546.2609 632.2397 641.0829 643.0252 647.3909 648.9718 650.6391 652.9839 655.1207 676.7562 696.7991 731.3975 744.4322 757.2233 762.2908 765.7741 769.4893 777.7754 780.6033 788.9243 795.2141 826.7745 832.5029 837.2596 852.9396 871.5290 889.0897 907.5462 913.6038 938.4216 942.8545 951.1541 962.3421 979.9568 983.6278 986.1318 989.8248 994.2383 1009.1806 1015.8867 1019.3107 1019.4611 1020.9827 1021.7210 1025.5616 1031.5417 1040.5298 1046.6354 1052.8645 1053.8434 1060.7232 1078.2013 1088.1724 1092.2480 1106.4109 1111.8375 1124.8382 1138.9473 1156.9210 1159.7370 1170.3515 1175.3476 1178.1582 1182.8697 1195.4946 1219.1810 1233.9200 1246.2706 1280.3221 1294.8452 1305.4102 1309.9822 1314.2504 1315.3024 1323.1301 1334.8737 1352.9140 1361.3646 1371.8640 1384.2570 1412.6848 1421.8581 1429.7053 1472.8877 1473.8455 1481.0953 1483.4039 1489.5539 1493.7048 1504.8389 1518.0434 1527.0275 1540.6694 1595.4553 1606.5203 1609.9468 1611.8207 1611.9765 1639.8069 1640.3810 1645.3136 1647.5250 1651.7149 1670.5254 3199.2680 3203.2590 3211.2805 3213.8425 3215.9980 3222.7071 3223.9120 3224.5939 3225.4862 3228.0469 3230.0604 3232.7064 3232.9255 3235.5618 3240.0427 3240.5197 3242.9479 3243.7892 3247.0251 3248.7944 3252.6421 3263.9629 3266.9601
redmass: 5.7485 5.6616 5.4141 4.2607 5.1746 5.5141 3.9897 4.1933 5.5005 6.1870 4.6377 4.6643 5.1128 6.5861 5.2185 3.8542 5.4272 5.6627 5.1147 4.7214 5.0014 7.5646 8.4815 6.4109 6.9706 6.8301 8.7943 4.2732 3.1698 2.7865 3.4925 3.9083 4.0482 6.0830 4.1030 2.7443 4.0505 4.0043 6.8881 3.2729 7.6029 5.3384 3.7626 7.1203 6.6431 7.0133 6.3624 6.8151 5.3701 4.4501 6.6835 1.8265 6.6529 4.0794 2.0587 2.1250 1.2599 1.7865 2.9514 1.3655 4.7464 1.9502 5.9309 2.4443 5.9354 1.3460 1.2599 1.3979 1.3361 1.3247 1.3934 1.4122 1.3231 5.1877 1.3097 1.3830 1.3852 1.3598 1.3784 1.3177 1.2950 1.7358 3.1185 1.3118 1.3487 6.9164 6.5708 2.5055 5.1838 7.1759 3.7326 4.7737 2.4457 1.7754 2.0365 1.7603 1.9404 1.7049 1.6934 1.4980 1.6474 1.0721 1.1154 1.0891 1.1256 1.3800 1.3776 1.2072 2.1451 1.6282 1.8669 2.3817 2.8103 7.5044 5.1392 2.7698 2.0698 3.5182 2.7635 3.3873 1.2229 1.7446 2.1873 7.1642 2.3070 2.2335 2.3419 2.2363 2.3653 2.0499 2.5858 1.8823 2.9680 3.1755 5.5702 6.1014 5.2699 5.2312 5.3183 5.2324 5.1488 5.5858 5.4263 5.2893 6.0050 1.0868 1.0892 1.0917 1.0948 1.0887 1.0879 1.0884 1.0980 1.0882 1.0892 1.0915 1.0973 1.0918 1.0911 1.0976 1.0947 1.0947 1.0952 1.0986 1.0983 1.0945 1.0932 1.0950
irintensity: 0.1043 0.1063 0.4105 0.1533 0.9312 2.3685 0.1462 0.0848 2.0764 0.3721 1.1877 1.9568 0.8001 0.1392 2.4894 2.4233 4.1286 2.0929 1.7003 0.4832 0.0935 1.0525 0.4490 0.5510 0.8308 0.2567 1.5008 2.2871 0.6146 0.8039 2.4178 9.1977 7.5679 1.7383 9.4185 22.7873 3.0708 14.3031 0.0774 6.5038 9.6508 2.2620 0.3532 1.9719 6.3337 4.4786 0.9861 9.1675 17.3069 4.5231 1.7570 82.9870 7.9233 36.3882 1.3155 4.2376 41.6259 42.0851 48.1805 189.8664 0.6045 0.0845 6.4917 5.0902 0.5035 84.0768 1.0270 16.7287 0.3206 0.1309 0.0068 12.1588 3.5922 3.1597 3.4564 0.7632 1.3400 3.5195 1.4986 0.4877 0.0061 1.5362 2.0279 0.0043 0.4513 2.2742 11.8794 5.1409 15.7254 12.5399 3.1233 9.5386 6.1874 0.9848 0.3606 6.9034 2.3400 2.0064 1.0733 5.1148 0.0451 1.1875 4.4762 3.3076 5.0667 0.0176 5.5788 0.2540 8.8703 4.4081 14.2460 26.3574 21.6580 0.3726 18.6555 15.0748 11.1437 3.3041 7.0189 1.1259 7.6379 31.0828 78.8796 22.7766 7.0264 5.6631 84.4239 165.7563 24.2436 0.4487 25.8398 47.0714 5.6357 16.4155 4.8384 12.3557 8.5708 7.3354 5.5807 6.4025 18.6637 10.5752 16.6753 2.9540 8.8797 2.4726 0.2270 6.1838 30.3248 1.2791 0.6385 3.6156 37.8694 2.3888 2.3134 1.3399 10.8535 3.3698 0.3752 4.4799 0.5870 8.0944 1.2171 7.1306 15.5621 8.1206 4.3095 4.9308
temp: 298.150 k
press: 1.00000 atm
elementType: 44 6 6 6 6 6 6 6 6 6 6 6 6 6 6 7 7 7 6 1 1 1 1 1 1 1 1 1 1 1 7 6 6 6 6 6 6 6 6 6 1 1 1 1 1 1 1 7 6 6 6 6 6 1 1 1 1 1
symmnumber: 1
zpe: 1209292.0 jmol-1
zpe.correction: 0.460595 hartree
zpe.thermalcorrener: 0.488041 hartree
zpe.thermalcorrenthalpy: 0.488985 hartree
zpe.thermalcorrgfe: 0.402112 hartree
zpe.sumelectzpe: -1486.097419 hartree
zpe.sumelectthermal: -1486.069973 hartree
zpe.sumelectthermalent: -1486.069029 hartree
zpe.sumelectthermalfe: -1486.155901 hartree
dipole: 5.4066 -0.0322 0.7717
dipole: 5.4615
quadrupole: -98.7362 -121.8084 -171.9039
quadrupole: 4.2862 -0.7215 4.7531
quadrupole: 32.0800 9.0078 -41.0877 4.2862 -0.7215 4.7531
hfenergy: -1486.558014 hartree
pointgroup: C01 [X(C29H23N5Ru1)]
dipole: 2.1360106 -0.1885589 0.1373759 debye
polarizability: 816.9974679|2.700969|696.8127638|-54.6065719|36.1492952|439.9209751 unknown
InChI: InChI=1S/C15H11N3.C9H7N.C5H5N.Ru/c1-3-10-16-12(6-1)14-8-5-9-15(18-14)13-7-2-4-11-17-13;1-2-4-9-7-10-6-5-8(9)3-1;1-2-4-6-5-3-1;/h1-11H;1-7H;1-5H;/q-3;2*-1;+5
charge 2 multiplicity 1
58 atoms
Ru 0.04514557 0.02027934 0.09630953
C  -0.13067175 4.4345887 -0.06578924
C  1.21950086 4.7549691 -0.20335388
C  2.15870406 3.72418225 -0.22684135
C  1.73292898 2.39982658 -0.11204953
C  2.65672519 1.24954717 -0.10785051
C  4.05170614 1.29936048 -0.18033471
C  4.76764418 0.10090175 -0.15683239
C  4.1008077 -1.12367526 -0.06409059
C  2.70503109 -1.12733726 0.00875063
C  1.82438732 -2.30935853 0.08951368
C  2.30059297 -3.62084963 0.13647582
C  1.39733375 -4.68251871 0.19261217
C  0.03076507 -4.40767545 0.19876403
C  -0.3868214 -3.07919301 0.15535757
N  0.47507406 -2.04429631 0.10302541
N  2.02890399 0.04943429 -0.01154213
N  0.39796638 2.08880134 0.01748341
C  -0.49911214 3.09506656 0.03820224
H  -0.89689255 5.20085131 -0.04151656
H  1.54034546 5.78713661 -0.29084209
H  3.21415889 3.94478731 -0.33460006
H  4.56764316 2.24892345 -0.25269345
H  5.85025404 0.12004111 -0.21196328
H  4.66171019 -2.05011608 -0.05201135
H  3.36654336 -3.81313136 0.13020984
H  1.75957924 -5.70395887 0.2302386
H  -0.70889637 -5.19885443 0.23931661
H  -1.44009388 -2.82209796 0.16230687
H  -1.53835232 2.80626756 0.13801641
N  -2.08821555 0.02515143 0.14401289
C  -2.73325474 -0.61966798 -0.8888318
C  -4.10023572 -0.66687374 -0.99963159
C  -4.91331495 -0.03853888 -0.0183187
C  -6.33149658 -0.04656683 -0.05030809
C  -7.04695576 0.5922031 0.94360847
C  -6.38265278 1.26188547 2.0038063
C  -5.00472531 1.28625502 2.06174611
C  -4.24483538 0.63525275 1.05283678
C  -2.82909095 0.63210435 1.07145625
H  -2.08434705 -1.09082994 -1.6191962
H  -4.55553928 -1.18840916 -1.83518889
H  -6.83921883 -0.55847405 -0.86218919
H  -8.13231553 0.58495189 0.91767531
H  -6.96846326 1.75618355 2.77230855
H  -4.48679525 1.79462784 2.8697211
H  -2.29972421 1.14586318 1.86790468
N  0.11392504 -0.03876074 2.11387418
C  -0.65103141 -0.9440871 2.7792219
C  -0.64073401 -1.05205864 4.16446917
C  0.17838075 -0.2062199 4.91379415
C  0.96405186 0.72417278 4.23278563
C  0.91119425 0.78085944 2.8446222
H  -1.27780714 -1.58440725 2.17306221
H  -1.27334959 -1.79566392 4.63566759
H  0.20400716 -0.27124442 5.99607393
H  1.62025048 1.40794912 4.75906799
H  1.51358052 1.4932046 2.29844938
