program: Gaussian 09
title: 000032213
version: EM64L-G09RevD.01
frameworkgroup: C1[X(C7H10F3NO2)]
method: RPBEPBE
basis: SDD
operation: Freq
keyword: #p
keyword: freq=noraman
keyword: PBEPBE/SDD
title: #p freq=noraman PBEPBE/SDD
converged: YES YES NO NO
title: Mulliken charges:
elementType: F F F O O N C C C C C C C H H H H H H H H H H
charge: -0.155368 -0.165240 -0.153720 -0.262587 -0.224918 -0.093217 -0.411450 -0.419452 -0.393199 -0.504631 0.272109 -0.366527 0.433822 0.218731 0.243832 0.243477 0.217834 0.252983 0.189290 0.260277 0.272897 0.268658 0.276399
chargesum: 0.00000
title: Mulliken charges with hydrogens summed into heavy atoms:
elementType: F F F O O N C C C C C C C
charge: -0.155368 -0.165240 -0.153720 -0.262587 -0.224918 -0.093217 0.051113 0.041859 0.049073 0.028543 0.272109 0.178530 0.433822
polarizability: 1.17353390e+02 -3.84356932e+00 8.00200143e+01 -5.45155779e+00 -6.46919770e+00 7.28311909e+01
1716.lowfreq: -15.6578 -1.5555 0.0002 0.0008 0.0010 5.8640 9.8683 29.3448 41.2989
frequency: -7.1211 29.2112 41.2215 44.7389 87.5112 98.1764 129.3368 220.4875 226.4360 251.5543 275.3632 337.2123 364.2897 399.7589 456.3408 463.1015 510.8647 547.1897 595.4760 645.1540 716.5935 766.2799 785.4505 807.6247 812.7781 860.1729 909.5141 967.0690 986.9572 994.4845 1027.9530 1056.5385 1062.1159 1078.8266 1084.8928 1103.1576 1114.6194 1125.2223 1144.2295 1190.6632 1216.2500 1260.0014 1269.3703 1276.4768 1309.3629 1365.4363 1383.1544 1437.4894 1445.7342 1453.5719 1466.6213 1476.7598 1671.0271 2899.4997 3004.8840 3038.3530 3048.5326 3053.3000 3063.8517 3069.9336 3121.2181 3167.1480 3184.2624
redmass: 2.6802 6.4857 8.9117 12.4807 4.5500 3.6611 2.6379 5.7004 6.9929 5.8709 6.5213 3.3488 2.5322 4.5360 5.3330 6.7976 5.1015 3.4187 7.6825 5.4557 3.3559 6.5949 1.5459 2.0794 1.6934 4.3646 3.3279 1.5445 2.1820 2.5518 9.9396 1.8485 1.4624 2.3081 1.5034 2.3302 2.5039 1.6891 1.5190 1.3357 6.0128 2.4812 1.2454 1.3688 1.4487 1.3655 1.5320 1.0797 1.0930 1.0831 1.1218 1.1347 9.9355 1.0704 1.0619 1.0586 1.0912 1.0516 1.0623 1.0965 1.1057 1.1141 1.1151
irintensity: 2.3233 1.2549 0.3144 1.3806 1.2375 1.7473 5.2007 4.7893 2.6558 4.0413 2.9598 3.0663 13.6598 13.3221 5.7411 1.2090 13.6833 4.0237 16.0748 5.3435 10.5836 27.4980 9.7134 11.4033 6.0279 17.4871 122.8620 5.0620 24.5788 99.9610 265.8287 48.8508 36.6502 88.5152 4.4852 164.1175 54.4275 10.0611 2.7973 0.0860 120.1806 7.4143 56.1448 34.7866 32.1833 27.4606 85.2328 26.4295 20.1489 8.1046 0.3951 10.1276 152.5677 63.2510 11.2940 25.2135 4.1018 27.8997 30.3617 18.4583 0.6770 1.6327 39.5421
temp: 298.150 k
press: 1.00000 atm
elementType: 9 9 9 8 8 7 6 6 6 6 6 6 6 1 1 1 1 1 1 1 1 1 1
symmnumber: 1
zpe: 442623.1 jmol-1
zpe.correction: 0.168586 hartree
zpe.thermalcorrener: 0.181438 hartree
zpe.thermalcorrenthalpy: 0.182383 hartree
zpe.thermalcorrgfe: 0.126878 hartree
zpe.sumelectzpe: -776.392831 hartree
zpe.sumelectthermal: -776.379979 hartree
zpe.sumelectthermalent: -776.379035 hartree
zpe.sumelectthermalfe: -776.434539 hartree
dipole: -1.8976 -0.2148 -0.6756
dipole: 2.0257
quadrupole: -75.0461 -77.0429 -76.6627
quadrupole: -8.1696 -8.6408 3.1917
quadrupole: 1.2045 -0.7924 -0.4121 -8.1696 -8.6408 3.1917
hfenergy: -776.5614171 hartree
pointgroup: C01 [X(C7H10F3N1O2)]
dipole: -0.7232526 0.0307639 -0.3333517 debye
dipolederiv: -0.3661445 -0.1290482 0.0025731 -0.1451391 -0.8010744 0.0971095 -0.0568544 0.021335 -0.3436512 -0.8852655 0.2068591 -0.0627658 0.1603497 -0.4085225 -0.0074233 -0.2195628 0.0219732 -0.3350361 -0.485717 -0.0454709 0.1617276 -0.0506321 -0.2978726 -0.0211456 0.1979976 0.0223945 -0.6999173 -1.5394141 -0.2733531 0.0669416 -0.3305381 -0.5161986 0.0508314 0.1215729 0.0789449 -0.3231868 -0.7145095 0.1022415 -0.0159058 -0.2143732 -0.8521325 0.16393 0.0912959 0.1852865 -0.332705 -0.6548613 0.2460766 0.1341294 0.26484 -0.1738603 -0.0448861 0.1947874 -0.0566755 -0.4179211 0.1484012 -0.0444165 0.0579437 -0.089887 0.0086482 -0.0034627 0.0283527 -0.0235022 0.1921525 0.0978533 -0.1173753 0.0074731 -0.1173418 0.064274 -0.0739704 -0.0010268 -0.0628443 0.1626279 0.5318159 -0.1671891 -0.0025644 -0.0949261 0.1968176 0.0411489 0.0066652 -0.0073786 0.27861 -0.3465975 0.0993853 0.000187 0.1752258 -0.0927085 0.046501 -0.1441262 0.1276238 0.0572742 1.8304721 0.1050785 -0.0411929 0.5254493 1.1535401 -0.2735798 -0.1925384 -0.3367167 0.2995735 0.5039652 0.0032745 -0.0088793 -0.2954709 0.0144471 -0.0215022 0.0125157 -0.0359702 0.1052844 1.6457651 0.0013674 -0.047975 0.1196437 1.4976417 -0.0716954 0.1321333 -0.0326923 1.3667034 0.0265445 0.012479 -0.0389559 -0.0239656 0.0070829 0.1230575 0.0565811 0.1269013 -0.0521977 -0.1315981 -0.0303912 -0.049559 -0.0404427 0.0873749 0.0256379 -0.078383 0.0121674 0.0523842 0.0800124 0.0444608 -0.0367979 0.0820392 -0.1040067 0.0190783 -0.0411502 0.055222 0.0591512 0.0333627 -0.0089458 -0.1298016 0.0156375 0.0287042 -0.0074426 -0.0893408 -0.0762941 -0.0788026 0.0319238 0.0068791 0.0063277 0.0161002 -0.09878 -0.0608529 0.005247 -0.0628451 0.0565322 -0.0568857 0.0429398 0.0064475 0.0203126 0.0405283 0.0048802 -0.0869253 0.0851405 -0.212057 0.0717178 -0.0147616 -0.0155913 -0.0588663 -0.0297599 -0.0456565 0.0192884 -0.0775887 0.0883796 0.1027694 0.0104051 -0.013571 -0.0152442 0.1161033 0.008224 0.0589376 0.0074165 -0.0371676 -0.0434654 -0.0154612 0.0359484 -0.0063827 0.1337642 0.0289996 0.0520876 0.0040035 0.0094741 0.1198551 -0.0350339 -0.0161391 0.1036118 0.0259896 0.0222193 -0.0675544 0.0240985 0.1044954 unknown
polarizability: 118.0462536|-1.4548854|83.5978526|-2.8314684|-1.9700086|68.5604892 unknown
InChI: InChI=1S/C7H10F3NO2/c8-7(9,10)5-13-6(12)1-2-11-3-4-11/h1-5H2
charge 0 multiplicity 1
23 atoms
F  3.248752 1.534849 0.438736
F  4.269637 -0.442151 0.892983
F  2.274423 0.06864 1.864516
O  0.995048 0.087022 -0.714172
O  -0.017859 -1.896964 0.010312
N  -3.848008 0.126589 -0.477919
C  -5.079505 -0.081584 0.365893
C  -4.287269 1.212756 0.478485
C  -2.646167 -0.647401 -0.066368
C  -1.402066 0.053964 -0.638236
C  -0.130771 -0.722159 -0.389384
C  2.313963 -0.52158 -0.5079
C  3.008973 0.164332 0.665159
H  -5.017264 -0.782076 1.21048
H  -6.025504 -0.101865 -0.183255
H  -4.658837 2.128795 0.009642
H  -3.700896 1.362045 1.396538
H  -2.730334 -1.663387 -0.490918
H  -2.547743 -0.755156 1.040683
H  -1.287707 1.074284 -0.229472
H  -1.528507 0.178877 -1.73151
H  2.906247 -0.355136 -1.420739
H  2.215492 -1.599394 -0.288452
