program: Gaussian 09
title: 000032482
version: EM64L-G09RevD.01
frameworkgroup: C1[X(C20H23NO3)]
method: RPBEPBE
basis: SDD
operation: Freq
keyword: #p
keyword: freq=noraman
keyword: PBEPBE/SDD
title: #p freq=noraman PBEPBE/SDD
converged: YES YES NO NO
title: Mulliken charges:
elementType: O O O N C C C C C C C C C C C C C C C C C C C C H H H H H H H H H H H H H H H H H H H H H H H
charge: -0.422257 -0.216043 -0.276787 -0.113606 -0.370051 0.404037 0.403450 0.172227 0.178630 0.249244 -0.438267 -0.447057 -0.399761 -0.400473 -0.310355 -0.328402 -0.240148 -0.235359 -0.237774 -0.233722 -0.294872 -0.301904 -0.708733 -0.691036 0.258775 0.257610 0.238472 0.238950 0.181179 0.228806 0.368825 0.236160 0.229563 0.228029 0.227077 0.225784 0.225738 0.204640 0.175672 0.212178 0.181798 0.207234 0.262247 0.211383 0.203854 0.244913 0.210131
chargesum: 0.00000
title: Mulliken charges with hydrogens summed into heavy atoms:
elementType: O O O N C C C C C C C C C C C C C C C C C C C C
charge: -0.053431 -0.216043 -0.276787 -0.113606 -0.370051 0.404037 0.403450 0.172227 0.178630 0.249244 -0.179492 -0.189447 -0.161288 -0.161523 0.099630 0.137320 -0.012119 -0.008281 -0.011990 -0.007984 0.085440 0.092072 -0.027869 -0.032138
polarizability: 2.61809826e+02 2.52877175e+01 2.60171718e+02 3.93877461e+01 -5.87535955e+00 1.76608992e+02
1716.lowfreq: -11.3828 -7.0172 -0.0006 0.0002 0.0008 4.8842 7.7282 19.4600 36.6278
frequency: -6.5776 18.9429 36.4284 44.9857 49.6772 56.8063 70.9398 77.8164 93.4504 122.8455 148.5393 168.1967 188.0908 200.3189 214.9759 216.6556 252.8724 270.5225 292.4732 299.6116 308.8391 336.6582 352.8108 386.0365 407.5306 420.2606 423.6014 433.1727 452.4746 467.4100 480.2947 510.5919 531.4420 569.2284 586.1084 591.8674 617.7528 671.6129 693.5198 701.1163 729.9003 749.9959 761.2276 766.8560 778.7023 788.4332 799.6437 810.8949 816.7278 881.8941 895.5771 907.8553 912.2442 915.6564 935.6913 952.7169 956.9910 981.3832 986.1927 988.2349 997.3408 1021.1566 1025.5853 1032.5115 1033.2710 1065.2074 1077.3877 1084.2654 1094.7396 1098.2681 1106.1662 1125.4056 1159.0101 1166.8792 1172.8875 1179.7746 1184.9475 1199.5753 1203.9059 1239.5368 1255.1069 1263.4221 1287.5463 1287.8051 1293.8091 1300.6966 1353.0690 1364.2433 1365.7899 1374.2079 1375.7296 1381.1442 1389.4229 1394.0953 1408.2164 1438.8072 1445.8058 1451.0145 1451.6454 1466.0133 1469.0274 1469.3091 1475.7246 1477.9295 1486.0071 1487.7524 1495.7582 1595.3294 1598.7921 1600.4409 1618.6125 1621.1458 2818.4569 2838.0976 2854.5645 2987.3758 2987.9340 3036.5171 3039.4200 3046.6473 3065.2712 3076.7924 3080.0275 3097.1327 3098.8297 3109.5988 3123.4893 3124.4931 3132.8229 3134.8343 3144.9885 3147.5976 3162.1834 3162.8664 3409.6974
redmass: 3.9635 2.7679 2.5329 4.1250 4.7314 2.6897 2.3774 6.6269 4.1448 4.3903 4.0007 2.4178 3.8561 2.6736 2.8345 1.9144 2.5439 2.5261 2.2532 2.8482 2.9791 3.0105 4.6347 6.5146 3.8920 2.6274 4.2122 1.3854 4.7902 2.6408 2.1592 4.7078 2.8068 3.4967 5.4310 4.8781 6.9416 5.6496 5.9808 3.0556 5.3995 1.7460 5.6991 1.4354 2.2123 1.1915 1.1994 2.3879 3.1706 1.3998 1.8563 5.6820 2.0555 2.0036 2.3207 1.4432 1.8362 3.1933 1.3344 1.3402 6.1919 2.2291 2.2461 6.2994 2.0020 2.1084 1.9827 2.3730 2.0515 2.0954 1.7626 1.8592 2.1294 1.2730 1.1974 2.0624 1.9089 4.4540 2.4066 1.9430 1.2368 1.2621 1.1409 1.4718 1.2145 1.8620 1.3177 1.4923 1.3637 1.3255 8.9171 1.3608 1.2404 1.2173 3.4868 2.2376 2.7882 1.0903 1.0984 2.5765 1.0714 1.0574 1.0586 1.0628 1.0763 3.8778 1.0695 7.3855 7.4727 7.0005 7.3814 7.2087 1.0715 1.0725 1.0711 1.0363 1.0359 1.0588 1.0866 1.0862 1.0864 1.0971 1.0972 1.0999 1.1004 1.1072 1.0853 1.0852 1.0894 1.0897 1.0949 1.0948 1.1003 1.1003 1.0647
irintensity: 0.1112 0.2165 0.0892 0.2475 0.3009 0.2082 0.4036 0.2267 1.2824 0.2254 0.2245 1.9908 1.3312 0.2987 5.5300 5.0816 1.7522 2.1277 1.2520 2.9623 0.9766 7.1645 17.9745 23.2493 6.0700 2.6766 2.6432 39.8063 1.4327 3.3752 21.5668 1.2936 8.3498 4.6267 3.2053 12.0308 10.3269 15.7119 9.2888 10.6551 1.9994 113.1116 0.6162 0.3420 57.7999 9.0345 5.6365 0.1771 11.0236 0.1304 0.0922 3.7294 5.0458 3.8972 0.4006 0.0287 18.0985 28.2452 0.0414 1.0794 3.4855 1.1700 22.4366 71.7943 5.2500 4.1534 27.6078 6.4721 13.2373 40.6757 1.7631 5.5785 215.8056 4.3038 48.2859 2.1172 1.3985 166.1061 27.2371 0.1336 24.9641 13.5704 8.7525 2.8367 13.0855 0.8632 9.7515 31.1439 15.6210 6.9872 4.2661 2.5210 33.2558 9.3532 2.9211 27.8802 12.6610 0.9434 11.1128 9.0854 9.4637 6.2827 5.8150 10.5944 13.5425 1.5677 11.9775 101.6193 1.0347 55.0396 7.5631 5.3028 73.8075 81.7351 247.1231 22.9988 27.6715 30.1302 9.2343 12.3884 10.3693 35.3253 64.5255 21.3076 43.9283 12.7919 2.7603 0.3131 6.9105 3.2750 16.7180 33.6460 61.1023 6.3783 76.6384
temp: 298.150 k
press: 1.00000 atm
elementType: 8 8 8 7 6 6 6 6 6 6 6 6 6 6 6 6 6 6 6 6 6 6 6 6 1 1 1 1 1 1 1 1 1 1 1 1 1 1 1 1 1 1 1 1 1 1 1
symmnumber: 1
zpe: 1009493.8 jmol-1
zpe.correction: 0.384496 hartree
zpe.thermalcorrener: 0.406679 hartree
zpe.thermalcorrenthalpy: 0.407623 hartree
zpe.thermalcorrgfe: 0.332183 hartree
zpe.sumelectzpe: -1054.579924 hartree
zpe.sumelectthermal: -1054.557741 hartree
zpe.sumelectthermalent: -1054.556797 hartree
zpe.sumelectthermalfe: -1054.632237 hartree
dipole: 2.3547 0.0333 -3.7652
dipole: 4.4409
quadrupole: -128.9034 -129.3066 -145.0059
quadrupole: 0.9807 6.4420 2.1916
quadrupole: 5.5019 5.0987 -10.6006 0.9807 6.4420 2.1916
hfenergy: -1054.9644199 hartree
pointgroup: C01 [X(C20H23N1O3)]
dipole: -1.0109589 -0.6960868 1.2434343 debye
polarizability: 261.2278103|-42.1766924|234.7804526|27.8967788|34.3481838|202.5822731 unknown
InChI: InChI=1S/C20H23NO3/c1-3-21(4-2)13-14-24-19(22)20(23)17-11-7-5-9-15(17)16-10-6-8-12-18(16)20/h5-12,23H,3-4,13-14H2,1-2H3
charge 0 multiplicity 1
47 atoms
O  1.114672 0.406827 -2.339452
O  -0.478525 -1.39258 0.423261
O  -0.773479 -1.408229 -1.89284
N  -3.437871 -0.713008 0.212238
C  0.935915 0.070002 -0.930256
C  0.648742 1.308171 -0.067924
C  2.219839 -0.479922 -0.284041
C  1.622466 1.429965 0.963027
C  2.592746 0.32151 0.831447
C  -0.210192 -0.976726 -0.852004
C  -0.370059 2.256181 -0.223668
C  2.990248 -1.580599 -0.680677
C  1.562298 2.507015 1.871022
C  3.745367 0.002864 1.57811
C  -2.839187 -1.688897 1.147307
C  -1.581143 -2.384612 0.609344
C  -0.424134 3.346796 0.682252
C  4.15424 -1.897496 0.065969
C  0.529947 3.465223 1.72276
C  4.522398 -1.115152 1.188023
C  -4.346785 0.250097 0.898168
C  -4.098641 -1.362567 -0.956071
C  -3.639776 1.179521 1.902715
C  -4.251102 -0.424302 -2.167742
H  -1.103435 2.162203 -1.03144
H  2.709829 -2.176793 -1.556044
H  2.302344 2.612662 2.672286
H  4.044658 0.608146 2.44119
H  -3.555517 -2.50274 1.443886
H  -2.558054 -1.159991 2.073224
H  0.465159 -0.157004 -2.850501
H  -1.749288 -2.903153 -0.349516
H  -1.189837 -3.092545 1.358638
H  -1.207015 4.106105 0.575533
H  4.775994 -2.750139 -0.228787
H  0.472351 4.312833 2.415073
H  5.423848 -1.374147 1.754892
H  -4.805746 0.875043 0.111839
H  -5.189674 -0.28657 1.408508
H  -3.471429 -2.213807 -1.273022
H  -5.09651 -1.782676 -0.666723
H  -3.302066 0.651189 2.812315
H  -2.758555 1.650678 1.43502
H  -4.335484 1.974756 2.22896
H  -4.911519 0.436285 -1.958719
H  -3.260342 -0.043221 -2.467986
H  -4.685793 -0.976495 -3.021493
