program: Gaussian 09
title: /home/michael/molsimp_comfiles/Cr_32a_31_VAC/Cr_32a_31_VAC.com auto generated
version: ES64L-G09RevE.01
frameworkgroup: C1[X(C23H17CrN7)]
method: UTPSSh
basis: Gen
operation: Freq
keyword: #PGeom=AllCheck
keyword: Guess=TCheck
keyword: SCRF=Check
keyword: GenChk
keyword: UTPSSh/ChkBas
keyword: Freq
title: /home/michael/molsimp_comfiles/Cr_32a_31_VAC/Cr_32a_31_VAC.com auto ge
converged: YES YES NO YES
polarizability: 7.34931082e+02 -1.07991592e-02 5.74867486e+02 1.24732213e+01 2.53435264e-02 3.92724310e+02
1716.lowfreq: -15.1320 -7.7186 -0.0005 0.0001 0.0011 7.5327 22.4203 35.1869 55.0263
frequency: 21.8787 30.0112 54.9871 56.7001 70.6248 73.0821 104.0124 109.1984 117.1638 127.4673 148.2773 166.8799 168.1247 217.4793 217.5587 233.6837 261.1204 275.3080 300.2401 318.1364 327.4658 349.9335 370.2106 401.5643 415.8879 421.5105 422.3317 426.9815 449.9473 451.0963 461.4941 474.2354 504.3181 523.9653 545.0221 555.3145 628.8229 635.9306 640.0256 643.7450 650.2863 663.8644 665.6480 688.9149 730.6905 736.4687 755.9893 758.8135 762.7160 777.9633 794.9620 801.7177 821.5498 830.5500 835.2579 844.2622 847.1954 907.9311 909.6359 937.0583 984.5713 984.8457 1000.7497 1006.0009 1013.2934 1016.6999 1017.2228 1018.1992 1018.5284 1022.6518 1026.0294 1026.0961 1027.0043 1033.6167 1054.4821 1074.6135 1079.9247 1088.5521 1098.7031 1105.9823 1112.3495 1124.7715 1133.3642 1138.4716 1158.5986 1160.1605 1177.5211 1177.8792 1190.9403 1250.4129 1279.4432 1305.7862 1308.8944 1312.3153 1317.6233 1331.5033 1332.2768 1343.4938 1365.7042 1366.8761 1375.3087 1424.1692 1440.7333 1444.8359 1476.9862 1481.8039 1487.5427 1493.2563 1499.2124 1509.5530 1527.5914 1587.9057 1593.7442 1597.9149 1610.1888 1612.7976 1621.7499 1628.6722 1645.5216 1647.9542 1649.8132 3225.7972 3226.0490 3226.0796 3229.1140 3229.3402 3230.9150 3236.4577 3236.5260 3240.1139 3242.4112 3242.4871 3243.9180 3248.8032 3255.1035 3255.4225 3255.8479 3260.8670
redmass: 5.8627 5.4368 6.2396 5.7985 4.7785 4.1980 4.0920 4.8226 5.8967 4.9199 5.9241 6.0151 6.0130 6.4826 4.6505 4.6301 4.9211 5.9351 7.1545 9.1888 10.4258 7.0377 8.3173 15.9920 3.4882 4.8319 3.4842 3.4364 5.4797 3.8316 5.1594 5.3502 6.9154 3.1169 5.1835 2.7555 3.7592 7.4027 7.9777 7.2644 6.9732 7.2299 7.7553 8.0543 6.6260 4.2538 2.0249 3.5794 2.1578 1.2153 2.0021 6.5676 1.7868 1.4160 2.2970 2.9974 5.7940 1.3213 1.3603 1.4120 1.4027 1.4028 1.3528 1.3555 1.3501 1.4159 8.1389 1.6822 4.0600 8.0557 1.4226 1.3327 6.5263 7.5268 7.3022 4.4855 2.3119 1.9413 2.2742 1.5696 2.0086 1.6135 1.5533 1.7097 1.9422 1.4763 1.0868 1.0879 1.3834 1.7834 3.2068 1.6091 2.2072 8.4570 2.4804 5.1568 3.0742 2.9277 5.0733 3.1514 2.1309 2.2588 2.1026 2.0395 2.3084 2.2802 2.0485 2.6644 4.5117 2.5479 3.6675 4.1168 5.4597 4.5770 5.1314 5.6027 5.8599 6.2485 6.1274 5.6043 5.7376 1.0926 1.0885 1.0885 1.0892 1.0929 1.0909 1.0918 1.0918 1.0924 1.0961 1.0962 1.0927 1.0977 1.0993 1.0958 1.0957 1.0978
irintensity: 0.0782 0.2267 2.4784 1.4942 9.8012 2.0729 0.3914 0.0039 0.6940 1.5593 4.2767 9.5855 3.0714 8.1829 1.4719 0.2095 0.0528 13.8320 1.1214 20.6345 5.3075 3.3530 8.8527 3.6630 0.0275 0.1480 19.0281 0.7585 14.3686 0.6136 3.3419 1.2292 1.7159 10.4008 2.7350 0.0259 1.4049 1.7131 8.4300 9.1086 10.4238 2.3774 0.8743 7.1524 6.7612 30.5175 2.1548 85.5526 16.2646 247.5104 0.1061 7.0879 8.5693 48.8530 5.6864 0.0014 0.0213 0.0048 0.9440 0.0784 2.5412 0.0401 0.0305 0.4694 0.8700 1.2137 33.6815 0.3604 2.0370 70.7195 0.9617 0.0760 4.0086 3.1563 2.7163 0.2898 14.1786 0.8356 5.4799 2.2422 2.3386 0.0556 5.6991 0.0059 9.2288 0.0244 2.2885 5.7753 5.6734 22.3751 6.5783 40.4949 3.4894 41.2343 2.0956 22.8572 8.3948 52.4837 0.4861 13.7341 12.0532 55.8953 174.5754 218.1702 40.6531 21.4071 175.4990 2.7947 23.9729 96.4335 9.4796 54.5782 4.4288 54.3724 13.8239 18.4842 102.8395 7.0852 6.9026 82.8252 16.5176 6.4050 3.8676 2.9113 1.9317 7.1409 9.2095 0.3062 0.3351 0.6869 3.2840 4.4500 1.7070 6.0493 2.1447 11.6476 18.2007 1.3428
temp: 298.150 k
press: 1.00000 atm
elementType: 24 6 6 6 6 6 6 6 6 6 6 6 6 6 6 7 7 7 6 1 1 1 1 1 1 1 1 1 1 1 6 6 7 6 6 7 6 6 6 7 7 6 1 1 1 1 1 1
symmnumber: 1
zpe: 965816.3 jmol-1
zpe.correction: 0.367860 hartree
zpe.thermalcorrener: 0.391414 hartree
zpe.thermalcorrenthalpy: 0.392358 hartree
zpe.thermalcorrgfe: 0.314406 hartree
zpe.sumelectzpe: -1355.804120 hartree
zpe.sumelectthermal: -1355.780566 hartree
zpe.sumelectthermalent: -1355.779622 hartree
zpe.sumelectthermalfe: -1355.857574 hartree
dipole: 7.0237 -0.0035 -4.1371
dipole: 8.1516
quadrupole: -112.1708 -97.2399 -135.1458
quadrupole: 0.0189 16.8651 0.0021
quadrupole: 2.6814 17.6123 -20.2937 0.0189 16.8651 0.0021
hfenergy: -1356.1719802 hartree
pointgroup: C01 [X(C23H17Cr1N7)]
dipole: 2.0181556 0.0001859 -2.4924642 debye
polarizability: 701.1284338|-0.1404372|574.8628192|-102.857937|1.1728334|426.5316255 unknown
InChI: InChI=1S/C15H11N3.C8H6N4.Cr/c1-3-10-16-12(6-1)14-8-5-9-15(18-14)13-7-2-4-11-17-13;1-3-9-7(10-4-1)8-11-5-2-6-12-8;/h1-11H;1-6H;/q-3;-2;+5
charge 2 multiplicity 1
48 atoms
Cr 0.00885832 0.05750671 0.04355914
C  0.07130903 4.34425758 0.64680848
C  1.31219911 4.70802768 0.11876355
C  2.18995152 3.7128843 -0.3091952
C  1.80147176 2.37670939 -0.20090306
C  2.6216523 1.22228147 -0.57020118
C  3.94579448 1.2502738 -1.01321556
C  4.59774319 0.03938886 -1.25327725
C  3.93339584 -1.1666974 -1.02322124
C  2.60959874 -1.12882871 -0.57992037
C  1.77770077 -2.27783312 -0.21997256
C  2.15256723 -3.61695968 -0.33923216
C  1.2649175 -4.60658926 0.08101679
C  0.02796616 -4.2345551 0.61252084
C  -0.28434575 -2.88157683 0.70502785
N  0.5644526 -1.91642438 0.29383273
N  1.96519971 0.04927994 -0.38605333
N  0.58449032 2.02345592 0.30973747
C  -0.25468216 2.99381197 0.72839566
H  -0.63592886 5.08724671 0.99627415
H  1.59583113 5.75215713 0.04423293
H  3.15969751 3.96807292 -0.7198822
H  4.45946947 2.19345698 -1.15389229
H  5.62659938 0.03551382 -1.5953234
H  4.43740403 -2.11388311 -1.1717494
H  3.11954065 -3.87868159 -0.75234
H  1.53794491 -5.65289915 -0.00206622
H  -0.6866105 -4.97313296 0.95635899
H  -1.2323546 -2.55398947 1.11499638
H  -1.20609439 2.67251655 1.13546554
C  -4.23233215 0.0805863 -0.75885531
C  -2.85563859 0.07491944 -0.91658639
N  -2.03702894 0.06695267 0.16012525
C  -2.61563519 0.06480468 1.38900598
C  -1.626633 0.05600047 2.46926576
N  -0.34354712 0.05151136 2.01328344
C  0.6381093 0.04334186 2.94505245
C  0.33864558 0.03980974 4.29772092
C  -1.01176664 0.04494779 4.66102113
N  -1.99701558 0.05299393 3.75292519
N  -3.92943214 0.06986065 1.62822027
C  -4.72777041 0.07771962 0.54928081
H  -4.89511653 0.08698162 -1.6149713
H  -2.37579055 0.07660425 -1.88975243
H  1.65644997 0.0397878 2.57375049
H  1.12514297 0.03329423 5.04204512
H  -1.31312783 0.04257168 5.70312479
H  -5.79569455 0.08188994 0.74017979
