program: Gaussian 09
title: /home/michael/molsimp_comfiles/Cr_32a_31_OH/Cr_32a_31_OH.com auto generated
version: ES64L-G09RevE.01
frameworkgroup: C1[X(C23H17CrN7O)]
method: UTPSSh
basis: Gen
operation: Freq
keyword: #P
keyword: Geom=AllCheck
keyword: Guess=TCheck
keyword: SCRF=Check
keyword: GenChk
keyword: UTPSSh/ChkBas
keyword: Freq
title: /home/michael/molsimp_comfiles/Cr_32a_31_OH/Cr_32a_31_OH.com auto gene
converged: YES YES NO YES
polarizability: 6.03055609e+02 1.32921893e+00 5.46934423e+02 -5.40739855e+01 -3.51316983e+00 4.02687550e+02
1716.lowfreq: -17.1535 0.0004 0.0006 0.0007 4.8664 7.5110 13.9938 26.6187 40.6693
frequency: 11.8318 26.3692 40.6020 51.5241 62.7571 70.5823 79.6387 95.9431 104.9135 120.1424 129.2719 157.6965 162.8199 171.7443 197.3424 222.6931 225.2979 229.0361 245.6511 263.5824 290.0416 312.2741 322.2982 348.5926 362.0946 384.6772 406.6923 412.9906 417.7205 422.3750 429.1031 447.9269 451.0220 454.4050 489.0361 517.7013 541.9876 549.5982 631.3341 640.3473 648.7345 650.7478 657.4307 660.8968 673.4510 693.4707 730.4804 736.7426 750.4973 759.3906 765.9305 782.9423 796.4874 800.0684 824.1130 832.2260 839.4238 842.1852 847.7347 852.5894 912.4277 915.1970 939.5795 992.7591 993.3753 1017.6823 1023.3663 1026.2427 1028.2613 1029.1463 1030.3615 1033.3055 1033.9834 1034.4032 1036.7846 1037.9031 1050.8149 1053.0426 1078.2800 1078.9343 1094.8767 1104.7407 1117.9877 1122.6545 1127.4539 1138.2786 1140.5512 1162.3723 1163.7550 1183.1992 1185.2834 1209.6174 1265.0455 1273.2667 1311.2045 1314.1505 1316.8546 1319.7450 1326.8310 1331.5285 1340.3408 1365.4613 1368.6909 1376.7233 1435.8580 1439.3553 1457.2194 1477.0020 1483.7089 1486.7338 1495.6600 1500.5377 1516.1146 1538.3251 1598.8231 1606.0590 1607.7509 1613.7276 1617.4988 1619.1973 1636.1130 1640.3152 1646.1420 1650.1858 3230.4336 3231.4036 3232.2851 3233.9717 3234.1994 3239.6752 3243.8556 3244.0446 3244.9493 3251.2003 3251.9368 3252.0617 3252.2443 3255.5044 3255.7971 3263.1822 3263.4038
redmass: 6.4944 6.4883 5.3827 5.7598 7.8413 4.6046 4.7662 5.1063 4.1506 6.1900 5.4197 6.4848 5.6436 6.1371 7.4969 4.9200 4.9432 7.4758 4.8091 8.6526 6.6945 7.9292 14.0885 6.8310 8.3351 14.2215 4.0729 4.5662 3.3344 3.6046 4.0483 5.2911 4.7493 4.1036 7.1385 3.1472 5.4024 2.6772 3.7907 7.9982 7.0465 7.1860 7.1819 8.0304 6.9139 7.9916 6.5687 4.4144 2.0263 2.2770 3.9044 1.2118 1.7836 6.6548 1.7807 1.3676 2.3241 5.6931 15.4284 3.0935 1.3441 1.3396 1.4216 1.3923 1.3913 1.3489 1.3977 1.4310 7.3981 1.3894 1.4402 5.8454 1.4142 1.3966 7.0270 6.9564 6.8814 7.6681 4.2590 2.4785 2.0108 2.3728 1.9037 1.6571 1.5157 1.4054 1.6715 2.1589 1.6029 1.1010 1.0903 1.3005 2.0219 2.6562 2.5016 6.2871 2.6119 1.7552 8.9327 2.0727 2.2100 2.2560 2.9756 4.8780 2.2233 2.3044 1.9296 2.1933 2.2280 2.1270 2.5151 4.8501 2.8723 3.3038 4.5490 5.8832 4.5708 5.4224 6.0907 6.1697 6.8676 5.4429 5.6068 6.2265 1.0893 1.0923 1.0897 1.0923 1.0904 1.0912 1.0917 1.0959 1.0920 1.0938 1.0949 1.0920 1.0989 1.0969 1.0990 1.0987 1.0992
irintensity: 8.9649 0.0241 1.3636 5.7148 37.2689 0.1281 5.1126 2.2056 4.0175 2.5461 15.2486 3.2761 0.3687 0.6570 10.6896 7.9736 0.4536 1.0424 0.0580 5.9195 4.9950 17.3981 75.0449 15.8220 3.8882 87.2439 0.3040 2.8838 0.2137 11.5308 0.2492 4.7488 5.5510 0.1059 2.5113 9.2073 0.7557 0.0921 0.6788 0.4076 6.4177 9.0485 47.1449 58.4813 20.9312 42.1390 3.5228 22.9297 1.0025 4.2426 97.5934 266.9020 1.4628 7.2603 0.0105 43.2081 0.5837 1.9133 254.8351 1.5257 0.1409 0.2781 0.2697 0.2890 2.0170 0.0929 0.0012 0.3802 24.1863 0.2286 0.9498 16.4268 1.9750 0.8887 27.4571 27.3742 8.5366 26.8643 0.0687 6.5473 2.7620 0.3974 28.0554 25.1868 15.6917 0.1198 4.3056 3.6389 2.1940 5.0566 13.3517 12.2809 41.0837 21.3955 14.5871 0.5226 28.2950 6.2314 34.0220 4.8589 86.3187 6.3978 1.7993 51.5306 12.4311 306.0741 58.5840 17.2125 40.8254 200.6702 6.8399 5.3263 189.1107 22.0533 72.3736 21.4478 80.5835 49.2051 48.3681 362.7260 35.2998 71.0840 105.5012 0.6184 5.0040 14.7575 4.3774 12.6309 3.8568 1.0927 0.7231 0.0398 3.2128 1.1475 0.3709 6.6206 2.3002 0.0668 2.9369 0.5193 3.8769
temp: 298.150 k
press: 1.00000 atm
elementType: 24 6 6 6 6 6 6 6 6 6 6 6 6 6 6 7 7 7 6 1 1 1 1 1 1 1 1 1 1 1 6 6 7 6 6 7 6 6 6 7 7 6 1 1 1 1 1 1 8
symmnumber: 1
zpe: 974359.2 jmol-1
zpe.correction: 0.371114 hartree
zpe.thermalcorrener: 0.396278 hartree
zpe.thermalcorrenthalpy: 0.397222 hartree
zpe.thermalcorrgfe: 0.313731 hartree
zpe.sumelectzpe: -1431.056938 hartree
zpe.sumelectthermal: -1431.031774 hartree
zpe.sumelectthermalent: -1431.030830 hartree
zpe.sumelectthermalfe: -1431.114321 hartree
dipole: -5.6211 -0.0500 3.8648
dipole: 6.8217
quadrupole: -90.7569 -85.5761 -158.2751
quadrupole: 1.0404 -31.1993 -0.4238
quadrupole: 20.7791 25.9599 -46.7391 1.0404 -31.1993 -0.4238
hfenergy: -1431.428052 hartree
pointgroup: C01[X(C23H17Cr1N7O1)]
dipole: 2.2004461 -0.2158198 1.5213773 debye
polarizability: 602.4590781|-5.5313144|546.621533|54.9046172|7.5505876|403.5969705 unknown
InChI: InChI=1S/C15H11N3.C8H6N4.Cr.O/c1-3-10-16-12(6-1)14-8-5-9-15(18-14)13-7-2-4-11-17-13;1-3-9-7(10-4-1)8-11-5-2-6-12-8;;/h1-11H;1-6H;;/q-3;-2;+5;
charge 2 multiplicity 3
49 atoms
Cr 0.01452851 0.01553331 -0.78621553
C  -0.10086739 4.31794917 -0.28371247
C  1.24536498 4.62299723 -0.08556576
C  2.18390066 3.59071781 -0.04076503
C  1.7520417 2.27521842 -0.19837091
C  2.61959102 1.08892871 -0.13107501
C  3.99158225 1.06323487 0.13067793
C  4.63129063 -0.17636915 0.20107178
C  3.90903454 -1.36130399 0.04444325
C  2.53804289 -1.27524728 -0.20721336
C  1.59145439 -2.39239906 -0.34716108
C  1.92710978 -3.74183202 -0.25168404
C  0.92031861 -4.70055046 -0.37865543
C  -0.39517807 -4.29094823 -0.59503596
C  -0.67050287 -2.92853538 -0.68224776
N  0.29991875 -2.00561627 -0.56079907
N  1.94561418 -0.06662789 -0.31378214
N  0.43296358 1.99183348 -0.4072991
C  -0.47234252 2.98548018 -0.44599689
H  -0.85955852 5.09037587 -0.31976572
H  1.5660981 5.65162121 0.03607633
H  3.23391175 3.80439664 0.1155646
H  4.54707154 1.98063934 0.28096292
H  5.69691702 -0.21955599 0.39585549
H  4.39905954 -2.32357496 0.12223778
H  2.95461702 -4.03733458 -0.07733676
H  1.16467803 -5.7545745 -0.30769562
H  -1.2031154 -5.00529555 -0.69818086
H  -1.67525902 -2.56148135 -0.8533438
H  -1.50410575 2.70101648 -0.61395128
C  -4.11698547 0.16480685 -2.116932
C  -2.72938432 0.11477539 -2.0912429
N  -2.0662086 0.09267962 -0.91841008
C  -2.79020933 0.12099351 0.22603967
C  -1.99617677 0.0829312 1.48072419
N  -0.66075036 -0.0154913 1.30983678
C  0.10778172 -0.07262188 2.41307789
C  -0.45910561 -0.02431955 3.6807934
C  -1.84607712 0.08956465 3.75091662
N  -2.62378474 0.1411976 2.65519999
N  -4.11833768 0.17404195 0.28584409
C  -4.77433698 0.19572441 -0.8884597
H  -4.65955175 0.18176503 -3.05349868
H  -2.11778483 0.092443 -2.98562911
H  1.17814228 -0.15532529 2.26245703
H  0.15473216 -0.07123051 4.57136477
H  -2.35780151 0.1403192 4.70599441
H  -5.85672811 0.23821864 -0.83154751
O  0.2223791 0.0708084 -2.40965937
