program: Gaussian 09
title: /home/michael/molsimp_comfiles/Ru_3a1_14_OH/Ru_3a1_14_OH.com auto generated
version: ES64L-G09RevE.01
frameworkgroup: C1[X(C31H22N5O4Ru)]
method: UTPSSh
basis: Gen
operation: Freq
keyword: #PGeom=AllCheck
keyword: Guess=TCheck
keyword: SCRF=Check
keyword: GenChk
keyword: UTPSSh/ChkBas
keyword: Freq
title: /home/michael/molsimp_comfiles/Ru_3a1_14_OH/Ru_3a1_14_OH.com auto gene
converged: YES YES NO YES
polarizability: 9.16752617e+02 8.55583656e+01 6.77275261e+02 1.13718306e+02 2.12508260e+01 6.62458631e+02
1716.lowfreq: -5.7701 0.0005 0.0008 0.0010 8.6487 12.2263 18.9465 22.2061 27.0726
frequency: 18.2796 22.1826 26.6967 33.3245 38.7639 43.5649 49.2572 75.0734 88.6179 93.0616 119.5507 130.6318 140.3167 143.2118 156.4050 162.6301 168.1465 182.2341 189.2955 192.4842 199.9542 204.1908 225.2019 239.1701 251.7843 273.0621 275.5720 291.2310 299.7872 308.1388 319.6571 354.8228 358.5584 383.2313 391.4655 394.1336 404.9153 412.3312 414.9649 440.0411 460.8145 477.8170 478.4503 482.0919 486.1859 493.8761 500.0529 512.4109 524.8873 531.9881 532.8568 539.3102 541.6848 549.7927 578.8558 585.9220 608.4973 624.2561 637.8593 643.9150 652.5396 656.1703 673.0864 691.2933 701.0269 737.8674 748.6309 758.3869 764.7650 768.9993 771.2290 777.1080 783.8182 789.0666 791.2488 795.0846 815.6520 832.9384 846.9056 849.6727 857.1659 859.5566 865.0297 887.0909 891.8937 892.5656 900.0132 922.7012 948.8208 953.0059 965.7030 973.2465 979.3411 981.7240 985.4949 989.2971 992.1787 994.9509 997.1704 1015.6080 1019.6961 1026.9362 1036.0690 1041.1793 1059.6085 1061.9681 1074.3677 1088.2505 1105.1474 1155.7551 1156.4823 1157.5642 1170.4933 1170.6063 1175.8563 1176.5758 1186.1237 1202.9787 1220.9733 1240.0237 1240.2823 1249.5220 1261.0698 1283.2465 1286.4028 1291.4289 1294.2866 1302.4190 1313.6513 1331.2756 1332.1164 1351.5956 1365.0229 1377.2681 1414.5467 1426.2752 1429.1584 1430.3853 1433.8964 1451.9876 1463.4034 1472.7415 1475.2742 1483.9843 1496.2404 1501.2109 1524.3658 1536.2692 1540.9617 1543.3351 1558.5817 1581.3442 1592.7597 1607.7917 1628.3961 1637.2376 1643.0130 1644.9647 1660.5887 1661.7828 1673.1204 3193.2387 3197.7029 3200.6154 3206.0638 3207.5441 3211.5980 3211.8583 3214.9217 3215.2601 3218.7238 3219.5320 3223.5276 3224.3696 3224.9814 3226.1191 3226.6433 3231.0697 3233.4666 3259.0234 3267.1752 3624.4836 3741.2861
redmass: 6.3671 6.3847 6.1593 5.9751 5.1227 4.3394 8.1278 5.1160 6.2649 5.8782 5.1289 6.8400 7.0101 6.3386 7.0072 6.9068 6.7803 4.3411 4.2357 6.5604 7.1077 6.7556 8.4928 6.5583 7.3798 8.5695 7.9980 7.8334 6.8287 6.6073 8.4362 7.3874 4.8950 2.7082 2.7619 3.6822 5.2954 1.8199 5.1706 1.9338 2.4266 3.6849 4.5134 2.8908 5.9666 3.7716 3.9575 4.0162 6.8810 6.9773 4.5145 7.3841 4.5122 7.7526 3.9523 6.4052 7.7240 7.5330 7.3813 6.6765 3.6347 5.7066 4.3111 6.4064 4.9063 8.4517 3.6577 1.9232 1.2511 1.3429 1.4718 3.7723 5.5580 4.6945 3.8870 8.7725 2.7832 5.7674 5.4315 1.3781 5.8106 1.3917 1.4816 1.4047 3.1372 1.5014 1.4097 1.3961 1.4255 1.3406 4.3308 5.0714 1.3072 1.2893 1.3197 1.3807 1.2817 7.2243 1.3684 1.2962 1.3052 5.5427 2.3106 2.4071 2.1714 2.6311 1.8733 3.5523 2.9768 1.5235 1.5197 1.4980 1.2324 1.2869 1.1138 1.1856 1.3806 1.3903 2.5349 1.6280 2.8137 2.1546 2.9746 1.6279 1.7655 2.0223 1.8483 3.5185 2.7942 4.0629 3.5216 5.5746 6.6180 3.6216 1.6896 4.5773 3.6833 7.1957 6.6627 1.9749 4.4131 2.6743 2.5136 2.3099 2.0585 2.7779 3.9283 5.3204 3.8924 3.1795 5.0063 6.5871 5.8083 6.2907 5.8374 7.2592 5.1774 6.2294 6.9748 5.7792 6.0314 1.0871 1.0886 1.0864 1.0889 1.0869 1.0938 1.0877 1.0894 1.0952 1.0924 1.0911 1.0953 1.0974 1.0983 1.0917 1.0924 1.0985 1.0967 1.0937 1.0946 1.0825 1.0664
irintensity: 2.7355 5.1577 1.8571 9.6042 3.3950 0.1293 5.1221 1.6643 1.0401 3.4533 0.7971 4.2791 1.4373 0.7854 10.6220 3.4688 8.3165 7.5385 2.5100 2.3506 12.9823 1.8994 2.9134 6.7065 12.1632 45.7042 15.0836 1.2678 0.9077 17.0294 20.2941 82.6033 5.1902 36.8040 44.8047 7.1947 19.6585 99.1756 16.3781 82.2017 69.9693 1.6258 23.6779 16.5368 224.1490 48.0484 73.3828 18.3172 1.4592 3.0975 31.9914 4.4686 52.5490 5.3089 1.6383 25.0773 31.9955 6.7247 4.7909 7.7544 11.1454 6.6968 0.5437 4.0562 4.4313 18.0397 0.1421 151.7551 37.1127 50.4256 61.7201 5.4700 5.3490 1.0812 11.6817 129.4437 4.6611 4.8716 4.5416 75.2132 97.7004 62.0937 7.6122 51.5291 4.3367 9.0272 139.5610 0.3636 3.5638 4.7084 0.7279 5.1285 1.6642 1.4262 1.8605 3.5058 0.2573 1.2668 2.5988 0.0094 0.0021 8.4481 3.1101 8.7649 21.7269 2.5109 28.6538 75.0084 18.1988 12.2746 48.7209 3.8783 6.4038 3.8812 4.1144 9.6359 13.8556 9.7403 132.5738 6.0748 20.5900 21.0376 145.9967 1.5793 5.2986 159.7250 11.4145 287.2325 37.0033 2.7857 21.0019 657.6146 186.7331 0.8012 35.4433 130.6239 26.3483 27.6360 45.6628 13.8649 90.1605 101.8191 3.7762 11.1144 14.0799 472.3131 593.5258 984.9142 494.8326 10.4902 216.8280 73.4617 51.5544 5.4303 54.9340 163.9879 3.9127 59.4736 31.7206 1.3853 28.1529 9.5696 5.7818 0.8601 0.8051 0.0818 31.2528 5.5311 4.7647 34.0865 3.4362 2.0635 21.7872 38.7959 36.3332 6.6459 1.5360 26.9020 16.8478 12.0403 4.4834 280.5663 50.3373
temp: 298.150 k
press: 1.00000 atm
elementType: 44 8 6 8 6 6 6 6 6 7 6 6 6 6 6 6 6 8 7 6 1 1 1 1 1 1 1 1 8 1 7 6 6 6 6 6 6 6 6 7 1 1 1 1 1 1 7 6 6 6 6 6 6 6 6 6 1 1 1 1 1 1 1
symmnumber: 1
zpe: 1240913.7 jmol-1
zpe.correction: 0.472639 hartree
zpe.thermalcorrener: 0.505690 hartree
zpe.thermalcorrenthalpy: 0.506634 hartree
zpe.thermalcorrgfe: 0.406965 hartree
zpe.sumelectzpe: -1862.923724 hartree
zpe.sumelectthermal: -1862.890673 hartree
zpe.sumelectthermalent: -1862.889729 hartree
zpe.sumelectthermalfe: -1862.989399 hartree
dipole: 4.2199 -7.5216 13.8457
dipole: 16.3121
quadrupole: -142.2799 -224.1188 -242.8230
quadrupole: -24.2029 -20.8205 -21.2904
quadrupole: 60.7940 -21.0449 -39.7491 -24.2029 -20.8205 -21.2904
hfenergy: -1863.3963633 hartree
pointgroup: C01 [X(C31H22N5O4Ru1)]
dipole: 5.3709141 -3.4764457 0.5039564 debye
polarizability: 654.0486507|10.783289|772.9520332|-1.2410393|-181.4925491|829.4858256 unknown
InChI: InChI=1S/C14H8N2O3.C9H7N.C8H6N2.H2O.Ru/c17-11-7-2-1-4-8(11)13-15-10-6-3-5-9(14(18)19)12(10)16-13;1-2-4-9-7-10-6-5-8(9)3-1;1-2-4-8-7(3-1)5-6-9-10-8;;/h1-7,15H;1-7H;1-6H;1H2;/q-3;2*-1;;+6/p-1
charge 0 multiplicity 2
63 atoms
Ru -0.24105469 -0.09290059 -0.40602754
O  0.6600834 3.92682353 -1.39274513
C  0.89206446 2.71938422 -1.12958588
O  -0.03523163 1.95758874 -0.62520533
C  2.2624968 2.16513782 -1.33492334
C  3.31463219 2.976712 -1.7836083
C  4.63293409 2.4991774 -1.87621031
C  4.97492198 1.19574413 -1.50261349
C  3.9337471 0.38286699 -1.05690972
N  3.88954344 -0.92300875 -0.59747615
C  2.59468382 -1.23652252 -0.28392606
C  2.14095356 -2.51074616 0.2296203
C  3.0720898 -3.4328964 0.76235339
C  2.67300949 -4.67761352 1.22591036
C  1.31473572 -5.03301114 1.15542108
C  0.37908928 -4.14881042 0.63575188
C  0.75702696 -2.86766865 0.16858795
O  -0.19400035 -2.10285988 -0.370711
N  1.80510515 -0.18185346 -0.53285373
C  2.60097672 0.84242296 -0.99939864
H  3.09884391 4.00549511 -2.05069601
H  5.4109005 3.16699749 -2.23118977
H  5.99728553 0.83779866 -1.55347287
H  4.67693025 -1.55831667 -0.54799647
H  4.12026098 -3.15513869 0.8294834
H  3.40294452 -5.36401063 1.64152209
H  0.98802177 -6.00435407 1.51524542
H  -0.6708749 -4.41869629 0.57542715
O  -2.23232004 0.0314912 -0.22257349
H  -2.64298842 0.10302785 -1.10137705
N  -0.07431828 -0.02230498 1.65469388
C  0.80149363 0.85243092 2.24183816
C  0.96470986 0.91299696 3.60578131
C  0.20278574 0.04651058 4.41578332
C  0.27052558 -0.00139459 5.8323754
C  -0.52554549 -0.88986608 6.52376021
C  -1.41538606 -1.76003414 5.8361016
C  -1.50460143 -1.7372846 4.46187182
C  -0.69330911 -0.83136561 3.72569494
N  -0.80982829 -0.84270978 2.36682359
H  1.34548139 1.49094464 1.55850486
H  1.66603142 1.61694326 4.04099541
H  0.95100729 0.66650936 6.35101729
H  -0.47763707 -0.93017622 7.60725048
H  -2.02989603 -2.4486488 6.4069049
H  -2.17860244 -2.39401063 3.9218544
N  -0.39468415 -0.16890325 -2.50858116
C  0.27193453 -1.14560452 -3.21226187
C  0.23461587 -1.22295998 -4.58172291
C  -0.51584616 -0.27644469 -5.32806099
C  -0.60809224 -0.28790445 -6.74390734
C  -1.35957778 0.67158679 -7.39308336
C  -2.04637991 1.67682852 -6.66362046
C  -1.97507373 1.7140314 -5.28669527
C  -1.20869081 0.73801745 -4.59425938
C  -1.10249878 0.73719511 -3.18232563
H  0.82873772 -1.85515497 -2.61375455
H  0.78049838 -2.01081446 -5.0904268
H  -0.08256879 -1.05695098 -7.30191333
H  -1.42950886 0.66122951 -8.47648965
H  -2.62985435 2.41938232 -7.19855877
H  -2.49609492 2.47871538 -4.71830009
H  -1.60140613 1.50324529 -2.59746074
