program: Gaussian 09
title: /home/michael/molsimp_comfiles/Mn_31a_20_OOH/Mn_31a_20_OOH.com auto generated
version: ES64L-G09RevE.01
frameworkgroup: C1[X(C28H21MnN5O4)]
method: UTPSSh
basis: Gen
operation: Freq
keyword: #P
keyword: Geom=AllCheck
keyword: Guess=TCheck
keyword: SCRF=Check
keyword: GenChk
keyword: UTPSSh/ChkBas
keyword: Freq
title: /home/michael/molsimp_comfiles/Mn_31a_20_OOH/Mn_31a_20_OOH.com auto ge
converged: YES YES NO YES
polarizability: 6.99869264e+02 -2.34449400e+01 5.38253895e+02 -5.31178977e+01 3.26274962e+01 6.21598283e+02
1716.lowfreq: -0.0003 0.0004 0.0007 4.6322 9.1000 14.3330 17.6179 26.0555 28.5347
frequency: 13.2068 22.3609 27.9859 32.3687 39.0573 39.9788 50.2414 69.3045 82.9245 99.1869 101.7761 107.5113 110.2190 113.9439 121.6498 138.3259 151.2390 161.3152 166.5865 175.8732 184.6417 184.8981 200.5619 220.8974 232.9887 242.6927 252.3108 266.4398 279.6714 299.0585 338.9494 373.4149 383.0596 386.8989 387.3341 390.0947 403.0681 423.2420 438.8773 461.1297 475.1347 476.5597 480.1649 487.2409 489.0854 512.3693 523.7105 530.5815 539.4631 543.2563 563.4696 576.4203 634.2966 637.9267 641.6940 646.4720 655.3289 664.5740 685.5833 726.5289 754.2819 765.3126 765.9663 771.5024 775.0241 779.0120 780.5735 789.1337 796.0098 806.2308 830.5698 841.0333 848.1676 849.9147 862.9569 884.3962 893.9439 894.4365 902.9891 919.9680 946.3144 954.1090 964.6667 973.7030 982.9564 988.9345 993.3834 998.3650 1003.8125 1019.9899 1023.5008 1024.8392 1025.9907 1028.6099 1030.8378 1035.0487 1040.9184 1062.5163 1073.2721 1093.3637 1109.1175 1114.2588 1140.9474 1156.5909 1157.7477 1172.5476 1177.4617 1178.6075 1184.4621 1196.2323 1206.4913 1220.1237 1245.5729 1253.0557 1284.7626 1285.6929 1301.7037 1314.2002 1314.7650 1330.4860 1335.2634 1338.7544 1359.1069 1365.4312 1377.3949 1389.3891 1420.0536 1431.7541 1438.6477 1441.3423 1453.2087 1475.6339 1483.5704 1488.2186 1492.8715 1499.3675 1529.1688 1539.9571 1543.3796 1584.4900 1588.9598 1606.8592 1613.9169 1620.1055 1626.2097 1640.3544 1643.2523 1646.2804 1662.7152 1671.1809 3202.4130 3207.3853 3210.2709 3216.6787 3217.5668 3221.7357 3223.5644 3225.8499 3225.9292 3226.7092 3227.0920 3228.1507 3231.1672 3232.7994 3241.8171 3244.9221 3247.9627 3250.8287 3251.8972 3253.2769 3681.6347
redmass: 6.0477 5.7794 5.5577 5.4822 5.8753 5.2181 6.9798 6.4081 6.6326 7.2036 6.7505 6.7179 5.2077 5.5995 6.4857 9.1258 5.3871 8.2761 7.2352 7.6735 4.2457 4.0627 8.5482 6.4638 8.9372 7.0982 5.3522 10.1003 6.7382 13.1509 8.0643 3.9431 5.9707 4.6519 3.6951 3.2648 1.2887 2.9883 4.0368 4.1352 3.0065 3.1032 7.7039 3.4209 3.6957 14.3347 6.8349 7.1763 7.8793 8.4640 6.8867 4.1090 7.3772 7.3346 6.6774 3.6896 7.1227 4.6349 8.1895 4.9806 2.0149 1.2227 1.3094 8.3878 1.6199 3.8638 5.4640 4.7901 3.6859 2.5559 6.1938 5.8965 1.3449 2.5437 1.3159 7.5142 1.4013 1.5133 15.2903 1.3083 1.4063 1.4368 5.1957 5.2249 1.3086 1.3264 1.3800 1.3702 1.3605 1.3058 7.0919 1.3182 1.3604 1.3422 7.0163 2.3051 2.4039 2.7106 3.3795 3.0576 1.6538 1.9072 1.7743 1.5076 1.5028 1.2097 1.1090 1.1576 1.4187 1.5085 1.4183 1.8818 2.8969 2.2174 1.6457 1.8014 1.8861 3.2486 3.0904 3.2457 2.8845 2.4528 1.1037 3.8086 3.6839 6.1706 1.6023 6.9895 6.3716 2.6476 2.0069 2.5027 2.7945 2.3633 2.1939 2.0069 2.7473 3.0324 3.1031 6.9246 11.0594 6.0395 5.9295 5.8014 6.4556 5.2471 4.9803 6.1156 5.6761 5.9002 1.0867 1.0892 1.0872 1.0952 1.0894 1.0883 1.0909 1.0957 1.0983 1.0906 1.0906 1.0918 1.0921 1.0987 1.0948 1.0964 1.0947 1.0957 1.0956 1.0962 1.0686
irintensity: 2.8713 0.1970 0.2109 2.6764 5.2123 7.4898 4.0669 0.5301 2.5239 0.9106 2.8981 3.5016 2.2132 1.4861 1.6291 3.0461 3.3279 2.2332 16.7251 9.9797 8.0871 6.0913 19.8427 39.7413 54.1800 20.3237 2.5992 87.0851 43.7565 78.8719 48.2964 9.0106 10.6064 12.6947 7.0035 7.4183 238.5886 11.7498 6.7837 6.6294 7.9765 14.0892 9.1908 27.3989 3.2062 93.0572 0.0584 2.4016 12.8963 82.3440 3.6901 1.0524 19.5923 9.2294 28.2767 13.8085 18.8755 2.3106 69.0301 38.8773 1.6993 43.4562 53.3660 44.7731 131.0086 3.6131 15.5830 2.5184 7.0565 31.5835 26.5445 8.0121 90.7629 5.8140 78.8596 35.9995 15.4000 8.9798 275.7309 0.5921 0.0741 7.5098 9.1319 1.8436 2.1023 2.0287 4.5604 0.9136 1.8239 0.0287 15.8267 0.0176 0.6526 0.7538 40.5956 8.1071 14.6303 92.2589 6.2032 26.5299 3.6515 27.2700 6.6430 7.6843 2.1947 9.1927 7.5112 16.2150 3.8975 3.4935 27.0311 38.9103 9.7594 17.0545 1.8075 0.5820 25.0563 101.1054 61.6794 26.5547 6.5620 95.4542 62.4631 111.1204 8.1672 323.4717 31.2941 66.4010 78.2570 8.0491 12.6115 8.3212 209.2980 22.7939 57.9401 22.1961 24.9770 12.0621 18.6155 112.9273 1402.9037 5.2191 61.1113 48.6144 3.8655 37.9001 40.4368 18.9593 5.2374 117.7750 0.7531 0.8555 0.3271 26.0634 3.5464 6.2932 4.6138 15.5195 27.9694 0.4057 7.8010 2.6846 6.1476 18.2421 6.4512 2.7653 1.1061 3.7087 6.6569 2.7680 193.9554
temp: 298.150 k
press: 1.00000 atm
elementType: 25 8 6 8 6 6 6 6 6 6 6 6 6 6 7 7 1 1 1 1 1 1 1 7 6 6 6 6 6 6 6 6 7 1 1 1 1 1 1 7 6 6 6 6 6 6 6 6 6 1 1 1 1 1 1 1 8 8 1
symmnumber: 1
zpe: 1162549.0 jmol-1
zpe.correction: 0.442792 hartree
zpe.thermalcorrener: 0.475184 hartree
zpe.thermalcorrenthalpy: 0.476128 hartree
zpe.thermalcorrgfe: 0.375208 hartree
zpe.sumelectzpe: -1757.805333 hartree
zpe.sumelectthermal: -1757.772941 hartree
zpe.sumelectthermalent: -1757.771997 hartree
zpe.sumelectthermalfe: -1757.872917 hartree
dipole: -4.0624 8.1980 20.7052
dipole: 22.6366
quadrupole: -93.1700 -176.8332 -216.1399
quadrupole: 25.3329 -11.8323 -23.4451
quadrupole: 68.8777 -14.7855 -54.0921 25.3329 -11.8323 -23.4451
hfenergy: -1758.2481248 hartree
pointgroup: C01 [X(C28H21Mn1N5O4)]
dipole: -1.2974692 8.2934751 2.974931 debye
polarizability: 649.9779903|50.1072633|649.2403223|52.1199313|55.621646|560.5031293 unknown
InChI: InChI=1S/C11H7N2O2.C9H7N.C8H6N2.Mn.H2O2/c14-11(15)10-6-3-5-9(13-10)8-4-1-2-7-12-8;1-2-4-9-7-10-6-5-8(9)3-1;1-2-4-8-7(3-1)5-6-9-10-8;;1-2/h1-7H;1-7H;1-6H;;1-2H/q-2;2*-1;+5;/p-1
charge 1 multiplicity 5
59 atoms
Mn -0.00341176 -0.08994949 0.06990654
O  2.20801393 -3.67748807 0.39127581
C  1.77397945 -2.5073703 0.28787007
O  0.53479139 -2.1803013 0.17648278
C  2.74739094 -1.35190952 0.2794293
C  4.13025912 -1.50911083 0.35404608
C  4.92665194 -0.36258674 0.31571954
C  4.32841428 0.8910487 0.19786819
C  2.93129414 0.97339325 0.12657914
C  2.17349484 2.23633069 -0.02448377
C  2.77145963 3.49915104 -0.08087374
C  1.95851129 4.6235365 -0.22862621
C  0.57574416 4.46115295 -0.31946635
C  0.05357984 3.16954846 -0.25479438
N  0.83171647 2.08469504 -0.11030541
N  2.17639244 -0.14106509 0.1764556
H  4.55923242 -2.50027191 0.43604653
H  6.00683482 -0.44316535 0.37084297
H  4.93812234 1.78506458 0.15649156
H  3.84682244 3.60804975 -0.00949214
H  2.4031294 5.61204293 -0.27248072
H  -0.0888822 5.30937213 -0.43558464
H  -1.01424746 2.9897076 -0.32127936
N  -2.17348011 -0.07496321 0.09322056
C  -2.85747433 0.90496359 0.74524637
C  -4.23577622 0.94611986 0.74605254
C  -4.93332503 -0.06503598 0.05956195
C  -6.34817245 -0.15035751 -0.02221875
C  -6.92771821 -1.1869611 -0.72031611
C  -6.13068015 -2.17650405 -1.36228214
C  -4.75709296 -2.12420557 -1.30283535
C  -4.133115 -1.06407445 -0.58966991
N  -2.77201731 -1.03934824 -0.55737774
H  -2.24740546 1.63881587 1.25761611
H  -4.76297281 1.73817724 1.26672362
H  -6.95143094 0.60622156 0.46896011
H  -8.00868383 -1.25653848 -0.78629793
H  -6.61942903 -2.9791786 -1.90451374
H  -4.13319944 -2.86838357 -1.7862598
N  -0.10024175 -0.03130295 2.16569211
C  -0.7125483 -1.09951624 2.77958842
C  -0.79560661 -1.21018554 4.14413661
C  -0.23808722 -0.20093228 4.97285901
C  -0.2693851 -0.24555148 6.39001074
C  0.29957297 0.77774216 7.12221385
C  0.91815714 1.88231599 6.48021131
C  0.96363715 1.95471124 5.10416429
C  0.38751095 0.91372064 4.32717749
C  0.42159048 0.93801436 2.91376235
H  -1.12035455 -1.85414744 2.11882712
H  -1.28482317 -2.07210191 4.58521902
H  -0.74130765 -1.08991802 6.88276877
H  0.27668896 0.74099888 8.20695997
H  1.35727093 2.67102446 7.08240061
H  1.43536373 2.79288123 4.6003003
H  0.89170783 1.76820746 2.398269
O  0.049895 -0.30180875 -1.77665835
O  -0.68250264 0.75765977 -2.41035018
H  0.01957825 1.40462807 -2.61877065
