program: Gaussian 09
title: /home/michael/molsimp_comfiles/Cr_31a_8_OOH/Cr_31a_8_OOH.com auto generated
version: ES64L-G09RevE.01
frameworkgroup: C1[X(C30H22CrN5O4)]
method: UTPSSh
basis: Gen
operation: Freq
keyword: #P
keyword: Geom=AllCheck
keyword: Guess=TCheck
keyword: SCRF=Check
keyword: GenChk
keyword: UTPSSh/ChkBas
keyword: Freq
title: /home/michael/molsimp_comfiles/Cr_31a_8_OOH/Cr_31a_8_OOH.com auto gene
converged: YES YES YES YES
polarizability: 7.01590088e+02 -5.54808291e+00 5.93340661e+02 -2.62526114e+00 -1.40115064e+02 7.08706978e+02
1716.lowfreq: -14.6576 0.0005 0.0007 0.0008 2.4778 12.5490 16.5197 20.8372 23.6926
frequency: 13.7199 20.5893 23.5688 28.9904 29.8313 34.0221 45.8328 68.2377 74.2019 86.6686 98.4484 108.3507 108.9475 117.6873 122.6632 138.6521 156.3874 172.1044 175.3296 181.7655 186.9613 205.9301 226.7039 235.3634 243.3991 258.2460 261.8191 281.5325 300.9972 319.5588 333.5283 353.8454 365.1273 372.7620 386.2690 390.0199 391.4777 447.7188 461.6202 475.5757 477.8861 488.3322 490.5571 493.4043 503.7321 508.0556 522.9788 530.2851 534.1882 538.6122 541.4418 551.0027 552.1626 594.0112 611.7233 617.6051 640.0386 642.9880 647.4349 647.8809 654.4753 662.4819 669.3909 695.1937 737.2641 741.6208 749.7917 765.6594 766.1144 766.7074 769.5081 780.5645 781.8458 788.2651 795.8005 825.0519 841.7073 851.3516 853.4983 858.8382 861.0332 863.9913 879.3207 891.5610 892.7275 895.4065 947.5458 948.1382 956.6615 961.6467 976.4606 982.0935 987.0771 987.8891 992.2529 999.0610 1006.6688 1019.8750 1021.8541 1034.1248 1040.0327 1042.2605 1060.6820 1062.4003 1071.4643 1098.1246 1100.2685 1155.3819 1156.7707 1158.9363 1169.7872 1174.9501 1175.2669 1177.6478 1179.5668 1200.1430 1243.6624 1246.1456 1248.7154 1256.0459 1271.6256 1280.6414 1282.5925 1288.9298 1296.7299 1312.4434 1322.3592 1333.6680 1351.6058 1365.2981 1377.9421 1379.7881 1408.4766 1412.9466 1431.1915 1436.0226 1438.2874 1450.0440 1469.9837 1473.4030 1483.0834 1485.0650 1495.7200 1505.2029 1529.3965 1538.2767 1542.6213 1565.6698 1586.6397 1596.0748 1609.3503 1623.6107 1634.7771 1642.6779 1651.3763 1662.8811 1672.1121 1673.2989 3191.7173 3193.0639 3196.3984 3200.8967 3205.3793 3207.1995 3208.1614 3208.8292 3214.9627 3215.2525 3217.0852 3218.1967 3222.1477 3223.3365 3225.1848 3227.6225 3231.1776 3232.2031 3238.9214 3250.4801 3283.0899 3621.7178
redmass: 6.2791 6.2563 5.6764 4.7940 5.4057 5.4968 6.0807 6.7589 5.5224 6.6442 7.6822 6.2227 6.6180 6.1996 6.1545 8.0231 7.7859 8.1916 4.0933 4.2972 5.4045 7.1703 5.6772 8.7140 6.8632 7.3396 9.2825 8.2520 5.2387 9.6134 8.6882 6.5762 10.5292 4.6140 3.5931 3.6046 4.0878 9.8638 3.2117 2.9248 3.0878 3.8509 4.2872 6.0356 3.0936 1.7751 6.8590 7.0170 7.3292 3.3116 7.7309 6.0072 4.6874 6.6732 4.8531 4.2038 7.2724 6.2634 3.9073 3.6191 4.9847 4.3616 1.5968 4.6092 2.1955 5.2309 2.7837 1.9762 1.3291 1.2398 1.7914 3.6980 5.5346 4.7356 3.7498 6.0742 5.8589 1.3722 5.9629 1.4286 1.3409 1.4707 13.0959 1.3943 1.5170 6.2819 1.4853 1.3387 1.2446 4.9376 5.1712 1.3186 1.3234 1.2643 1.3807 1.3644 8.2819 1.2977 1.3138 2.2844 2.3881 1.8923 2.6013 2.1245 3.9145 3.1383 3.5378 1.5027 1.4852 1.5382 1.2029 1.1164 1.1886 1.3781 1.2935 1.4077 2.7750 2.3102 2.1351 2.0211 3.2060 1.6533 1.8438 2.0247 1.8591 2.8587 3.0053 2.9725 4.2718 2.6465 2.6633 1.4498 4.4298 1.7242 7.5638 3.6298 5.5869 2.1225 2.5146 2.4282 3.5604 2.4547 2.0830 2.8612 3.5568 3.1693 3.1963 6.0588 6.8658 6.2454 6.2987 5.8253 6.5674 5.0970 5.8243 5.7822 9.0362 6.0459 1.0857 1.0872 1.0890 1.0866 1.0890 1.0939 1.0872 1.0929 1.0893 1.0950 1.0902 1.0917 1.0975 1.0954 1.0983 1.0917 1.0987 1.0944 1.0964 1.0967 1.0714 1.0821
irintensity: 0.4576 3.9993 1.1174 10.5024 4.4111 5.1088 2.9761 7.0967 1.2420 10.3360 7.9378 3.2014 1.3127 1.0890 1.8969 24.5298 5.1681 2.8334 10.2939 4.4208 10.3106 13.7563 4.4000 40.0350 15.5006 26.7207 7.4945 31.7149 5.8685 19.7348 96.0317 25.0423 162.2015 15.4859 2.1870 6.9437 2.1462 24.8372 4.9184 7.9447 8.4689 96.6924 35.1125 143.7014 297.1081 100.6163 1.9582 1.5146 17.3052 1.5497 9.5848 29.1330 3.3367 7.2460 36.0401 17.8497 8.3469 31.4166 22.2195 20.1731 9.9249 2.9691 100.9813 1.6200 30.0485 32.2029 86.5214 20.1368 54.1403 32.2052 94.3046 6.2009 15.8557 0.6348 4.7616 14.0971 8.4341 113.5057 136.8765 12.8432 79.0644 4.6920 25.9218 14.9945 7.1418 3.9233 9.1640 4.8046 1.6009 16.6033 2.4494 1.7654 0.9958 0.1921 3.6694 3.7039 16.8225 0.0125 0.0083 7.1555 13.3581 13.6971 54.7345 39.2651 130.3674 8.2934 34.6610 9.0666 3.5354 66.1602 13.4413 4.8092 10.0161 7.9295 1.4531 15.6981 23.1621 44.4366 16.1839 50.8775 784.3243 4.5315 0.1069 2.7817 20.3442 28.5217 119.8679 10.9571 95.2000 61.1655 26.3125 107.1888 93.7820 51.7092 43.7731 53.9007 64.2594 16.3275 175.0407 6.0151 16.2220 16.3173 12.7258 464.1349 33.4017 14.5090 18.4917 171.8315 11.3952 79.8577 7.1695 43.9180 43.4622 32.1406 277.0142 5.1865 221.6485 90.0991 8.8977 15.6858 6.4074 1.4568 0.8842 41.9340 0.0571 37.0740 3.5626 31.6379 4.4208 2.7175 42.3148 17.5644 30.8950 1.9566 20.5387 17.4377 10.0574 3.4009 671.9108 258.0134
temp: 298.150 k
press: 1.00000 atm
elementType: 24 8 6 6 6 6 6 6 6 7 6 6 6 6 6 8 6 7 1 1 1 1 1 1 1 1 7 6 6 6 6 6 6 6 6 7 1 1 1 1 1 1 7 6 6 6 6 6 6 6 6 6 1 1 1 1 1 1 1 8 8 1
symmnumber: 1
zpe: 1220384.7 jmol-1
zpe.correction: 0.464820 hartree
zpe.thermalcorrener: 0.497959 hartree
zpe.thermalcorrenthalpy: 0.498903 hartree
zpe.thermalcorrgfe: 0.396470 hartree
zpe.sumelectzpe: -1817.167953 hartree
zpe.sumelectthermal: -1817.134814 hartree
zpe.sumelectthermalent: -1817.133870 hartree
zpe.sumelectthermalfe: -1817.236303 hartree
dipole: 4.5409 11.6276 9.7821
dipole: 15.8591
quadrupole: -127.7005 -219.7971 -225.4760
quadrupole: -13.3121 9.7711 -20.3169
quadrupole: 63.2907 -28.8059 -34.4848 -13.3121 9.7711 -20.3169
hfenergy: -1817.6327728 hartree
pointgroup: C01 [X(C30H22Cr1N5O4)]
dipole: -0.4414292 0.7393932 6.1797365 debye
polarizability: 699.0240555|-26.8804803|795.3864881|-40.1771594|-17.7063852|509.2271832 unknown
InChI: InChI=1S/C13H8N2O2.C9H7N.C8H6N2.Cr.H2O2/c16-10-6-2-1-4-8(10)13-14-9-5-3-7-11(17)12(9)15-13;1-2-4-9-7-10-6-5-8(9)3-1;1-2-4-8-7(3-1)5-6-9-10-8;;1-2/h1-7,14H;1-7H;1-6H;;1-2H/q-2;2*-1;+5;/p-1
charge 0 multiplicity 4
62 atoms
Cr -0.47476391 0.37518126 -0.44437765
O  -0.31900745 2.30504977 -0.29079236
C  0.73449369 3.13316338 -0.27950164
C  0.46913165 4.49795495 -0.01881073
C  1.48113067 5.45080932 -0.0000311
C  2.81506091 5.08453677 -0.24120926
C  3.11116004 3.75295942 -0.49955765
C  2.10348756 2.76599284 -0.52350725
C  2.40488674 1.38155751 -0.80372561
N  3.59861697 0.77749398 -1.14443745
C  3.36972048 -0.59120893 -1.34843693
C  4.10684711 -1.73141097 -1.70916973
C  3.36696511 -2.92179112 -1.7951549
C  1.97178165 -3.04020883 -1.54983986
C  1.23827941 -1.89926599 -1.18983283
O  -0.0756455 -1.74144531 -0.90914097
C  2.00825458 -0.73793756 -1.10748438
N  1.45062743 0.45992001 -0.77482166
H  -0.56266205 4.78328155 0.16486349
H  1.23030363 6.48781406 0.20439905
H  3.60514409 5.82783018 -0.22608233
H  4.14034631 3.45918289 -0.68709958
H  4.48566399 1.25721432 -1.24314038
H  5.1708733 -1.71183743 -1.91427314
H  3.90098054 -3.82647165 -2.07291516
H  1.49234306 -4.00969217 -1.64766437
N  -2.54786208 0.33641412 0.00978551
C  -3.35428457 1.37892182 -0.32729686
C  -4.71097429 1.35447888 -0.08242057
C  -5.25885475 0.2110095 0.52938431
C  -6.63504209 0.04635925 0.8387072
C  -7.06341198 -1.11655469 1.44049058
C  -6.14729505 -2.15878367 1.75797122
C  -4.80753878 -2.03187742 1.47117792
C  -4.3387746 -0.84125192 0.8504167
N  -3.00649753 -0.74936061 0.58329833
H  -2.85260604 2.21613205 -0.79615269
H  -5.33654867 2.19673051 -0.35802125
H  -7.32939494 0.84373346 0.59400639
H  -8.11416465 -1.24680408 1.67875086
H  -6.51690377 -3.0621243 2.23206077
H  -4.09458437 -2.8155561 1.70498939
N  -0.14766053 0.1543007 1.65758841
C  -0.67695574 1.09574083 2.50590164
C  -0.53868591 1.02362879 3.86988698
C  0.1760289 -0.05655993 4.45278637
C  0.36919332 -0.20738327 5.85054047
C  1.07645138 -1.2898302 6.33487691
C  1.61835797 -2.2623487 5.4542185
C  1.44746426 -2.14252664 4.09110191
C  0.7241432 -1.03787672 3.56645204
C  0.52205906 -0.8709293 2.17512344
H  -1.2127331 1.90719986 2.02819377
H  -0.9750457 1.7925743 4.49893681
H  -0.04473252 0.53596401 6.5250664
H  1.22332054 -1.40337814 7.40464559
H  2.16994959 -3.10314836 5.86257365
H  1.85697625 -2.87979553 3.40686339
H  0.92212076 -1.60201631 1.47972573
O  -0.91282635 0.60653416 -2.29778204
O  -1.57565877 -0.61567666 -2.79056251
H  -1.04822445 -1.30564693 -2.30476286
