program: Gaussian 09
title: 000032257
version: EM64L-G09RevD.01
frameworkgroup: C1[X(C28H22N2O)]
method: RPBEPBE
basis: SDD
operation: Freq
keyword: #p
keyword: freq=noraman
keyword: PBEPBE/SDD
title: #p freq=noraman PBEPBE/SDD
converged: YES YES NO NO
title: Mulliken charges:
elementType: O N N C C C C C C C C C C C C C C C C C C C C C C C C C C C C H H H H H H H H H H H H H H H H H H H H H H
charge: -0.261415 -0.226035 -0.468823 0.316168 -0.696158 0.193336 0.316811 -0.702916 0.274692 0.169399 0.183167 0.271918 0.194401 -0.586654 0.428847 -0.594001 0.553214 -0.410733 -0.376928 -0.404863 -0.422931 -0.395483 -0.497026 -0.424584 -0.402489 -0.237678 -0.235588 -0.241078 -0.234222 0.214309 -0.760605 0.247160 0.248539 0.248268 0.245995 0.324064 0.274536 0.239448 0.238324 0.264289 0.241293 0.237448 0.227623 0.240453 0.235485 0.301692 0.224821 0.224745 0.224524 0.223866 0.255848 0.231780 0.263746
chargesum: 0.00000
title: Mulliken charges with hydrogens summed into heavy atoms:
elementType: O N N C C C C C C C C C C C C C C C C C C C C C C C C C C C C
charge: -0.261415 -0.226035 -0.167131 0.316168 -0.200460 0.193336 0.316811 -0.208654 0.274692 0.169399 0.183167 0.271918 0.194401 -0.262590 0.428847 -0.319465 0.553214 -0.171285 -0.138604 -0.140574 -0.181639 -0.158035 -0.269403 -0.184130 -0.167004 -0.012857 -0.010843 -0.016553 -0.010356 0.214309 -0.009230
polarizability: 4.94545296e+02 1.24036535e+00 3.12403770e+02 -2.61086657e+01 -6.96989111e+00 2.58552519e+02
1716.lowfreq: -8.3240 -4.6422 -2.0628 -0.0009 -0.0007 -0.0003 9.3065 18.3000 23.7316
frequency: 9.1177 18.1633 23.7129 46.0857 57.1670 63.6311 86.8506 118.1635 133.6789 134.4471 145.3401 165.3263 167.8214 189.8069 211.1658 236.6159 239.7460 256.9847 274.1564 315.8649 343.2223 346.6136 359.9901 373.5036 401.0285 421.2814 423.7617 435.0557 435.4817 439.5686 478.5418 495.8197 503.7011 508.2267 510.0346 544.3967 548.2676 567.9247 577.5416 591.8178 593.4428 605.1975 634.3953 641.6891 647.5121 704.4400 706.9933 718.6029 732.9873 738.4566 741.5592 746.7128 758.2175 773.1597 777.0337 818.2163 818.5429 822.5102 833.7355 852.6324 864.8471 869.3551 875.2746 907.8201 926.0373 931.8553 943.1903 943.5983 945.0520 956.5071 966.6769 975.7762 983.0763 985.4693 993.2195 993.9758 1010.1315 1024.7987 1024.9608 1031.6949 1094.3306 1095.7550 1113.6579 1123.8445 1131.7578 1133.6887 1144.7060 1152.2456 1168.1316 1168.3755 1182.6965 1187.1381 1191.8892 1203.0153 1204.8076 1221.5319 1236.2220 1246.4777 1281.2911 1291.0134 1294.3877 1307.0179 1309.3007 1319.2513 1367.5291 1374.8375 1381.4850 1388.1537 1390.9319 1425.3321 1426.2593 1441.1235 1442.9847 1444.2202 1446.4136 1453.4499 1459.5665 1460.3201 1462.9900 1480.7856 1485.5335 1498.2272 1585.4031 1589.9371 1590.1667 1592.0815 1610.1271 1620.5811 1620.7352 1624.4186 1633.6908 2982.7309 2984.2194 2999.5102 3027.0248 3028.3327 3087.3681 3115.7206 3119.4603 3120.3251 3126.3590 3127.4672 3129.6919 3136.2534 3140.2150 3141.2395 3144.2777 3148.4673 3159.7135 3160.1861 3174.8873 3197.9480 3520.6004
redmass: 6.1495 4.1617 4.0351 6.2998 6.5154 5.7769 3.7000 5.0878 3.8645 3.9599 4.6723 1.2084 3.2402 5.0130 5.9122 2.1287 2.1273 5.1522 5.8663 4.1591 2.9909 3.2967 4.1854 1.8908 4.7437 2.8066 2.7298 2.8799 2.9040 5.4253 5.6422 4.1942 4.1382 3.4333 3.4786 5.8121 6.0792 3.2353 4.2036 4.0863 3.1632 4.4885 6.2384 6.2988 6.4823 3.0918 3.0739 5.3702 5.3325 1.6864 1.6755 5.3689 5.0616 1.9837 2.1032 2.5722 2.1595 4.5139 1.5154 5.7949 1.3971 1.3702 1.3806 1.5764 3.3391 1.5725 2.0811 1.6597 1.4854 1.3832 1.8783 1.7869 1.3334 1.3486 5.4292 6.6245 1.8768 2.1163 2.1218 1.6544 2.2149 2.1303 1.9661 1.8077 1.1516 1.1496 1.8173 1.5150 1.1419 1.1363 1.7490 1.7389 2.3106 1.8001 1.9166 2.2301 1.9383 2.2609 2.6495 1.5941 1.7756 1.9111 2.1539 3.2021 4.5818 7.6559 1.2419 4.4015 3.7541 1.1627 1.1650 1.7379 1.8555 2.2995 2.7851 2.0832 3.4166 1.0579 2.8864 2.2635 3.0499 3.0968 7.2362 6.7206 6.7383 6.0643 7.6843 7.3168 7.2574 7.4580 7.2227 1.0609 1.0610 1.0368 1.0993 1.0992 1.0974 1.0876 1.0853 1.0852 1.0895 1.0894 1.1006 1.0899 1.0946 1.0946 1.0950 1.0924 1.1002 1.1003 1.0934 1.0929 1.0775
irintensity: 0.1329 0.1274 0.0634 0.2423 2.8329 0.0061 1.6607 1.8018 0.8659 0.0932 0.3347 0.4805 1.6348 0.1454 1.6810 10.6253 11.1438 1.5215 2.3362 0.7869 15.5525 36.0146 28.6641 45.6331 23.0703 9.9741 21.9653 0.1837 0.0438 5.7343 18.1969 0.9695 0.5145 0.8452 0.1138 0.0270 0.2995 5.5239 21.8653 1.2661 1.3379 3.2676 3.1292 8.3245 1.5028 0.0083 0.2098 1.1098 4.0695 45.3306 51.5389 3.0846 1.8880 65.4516 51.3564 9.6429 17.2560 2.4862 30.4179 0.3325 1.4154 0.0533 8.8766 5.7243 8.0371 2.1501 5.8685 3.9155 1.1851 1.1970 11.8347 21.3518 0.2243 1.1704 10.8288 1.2295 20.5600 9.0342 11.0777 7.7575 1.9416 6.2819 3.4957 21.4149 0.0081 0.2076 12.1689 8.7402 0.0260 1.0216 9.6573 2.0787 7.7353 10.7139 10.9424 12.7615 31.6292 63.9774 181.2496 20.7965 24.5957 8.9622 81.5227 161.8794 21.4145 47.4086 35.1997 11.5688 2.8646 19.4362 7.7756 48.7955 17.4332 101.2979 38.3760 5.7679 102.3181 11.7429 27.1127 30.3292 64.5454 29.7253 25.5585 0.6668 5.7803 16.8812 200.9131 0.7353 13.4524 53.9866 142.2431 11.6783 12.3010 7.4269 6.5323 6.7143 7.8113 20.9415 3.5001 4.6834 2.9874 4.0629 13.7190 5.4948 24.3900 33.8112 28.4404 7.3693 46.3693 43.6334 7.2800 9.3030 52.8126
temp: 298.150 k
press: 1.00000 atm
elementType: 8 7 7 6 6 6 6 6 6 6 6 6 6 6 6 6 6 6 6 6 6 6 6 6 6 6 6 6 6 6 6 1 1 1 1 1 1 1 1 1 1 1 1 1 1 1 1 1 1 1 1 1 1
symmnumber: 1
zpe: 1099911.2 jmol-1
zpe.correction: 0.418934 hartree
zpe.thermalcorrener: 0.443766 hartree
zpe.thermalcorrenthalpy: 0.444710 hartree
zpe.thermalcorrgfe: 0.362053 hartree
zpe.sumelectzpe: -1262.825689 hartree
zpe.sumelectthermal: -1262.800857 hartree
zpe.sumelectthermalent: -1262.799913 hartree
zpe.sumelectthermalfe: -1262.882570 hartree
dipole: -0.7528 -0.0975 2.1576
dipole: 2.2872
quadrupole: -171.0926 -177.5357 -168.0818
quadrupole: -3.9168 -4.3074 9.0571
quadrupole: 1.1441 -5.2990 4.1549 -3.9168 -4.3074 9.0571
hfenergy: -1263.2446228 hartree
pointgroup: C01 [X(C28H22N2O1)]
dipole: -0.2744611 -0.1635931 -0.8412157 debye
polarizability: 493.0570486|4.9659199|306.1199388|31.6427764|-18.558267|266.324598 unknown
InChI: InChI=1S/C28H22N2O/c1-18(31)30(24-11-13-28-22(17-24)15-20-7-3-5-9-26(20)28)29-23-10-12-27-21(16-23)14-19-6-2-4-8-25(19)27/h2-13,16-17,29H,14-15H2,1H3
charge 0 multiplicity 1
53 atoms
O  1.060029 -3.160045 2.484092
N  0.418534 -2.34638 0.371563
N  -0.568962 -2.444044 -0.622099
C  3.682133 -0.463351 0.689987
C  4.987967 -0.228328 1.441563
C  3.612406 0.400299 -0.443038
C  -3.134028 0.096387 0.345556
C  -3.63658 1.141204 1.335524
C  5.66429 0.862082 0.617198
C  -4.03996 -0.005956 -0.753634
C  4.835783 1.2210 -0.491576
C  -4.931279 1.62774 0.691602
C  -5.151473 0.938557 -0.541836
C  2.653944 -1.36663 0.995868
C  1.512254 -1.416349 0.143046
C  -1.97358 -0.688605 0.412791
C  -1.705653 -1.60161 -0.644698
C  2.478859 0.350823 -1.281432
C  -3.767096 -0.914239 -1.801152
C  1.437093 -0.552921 -0.988349
C  6.903793 1.494078 0.81562
C  5.251659 2.216945 -1.403652
C  -2.605201 -1.710125 -1.744743
C  -5.844124 2.595369 1.143169
C  -6.293372 1.222845 -1.324325
C  7.32049 2.493723 -0.100089
C  6.499754 2.850427 -1.199475
C  -6.990278 2.880038 0.357137
C  -7.210083 2.19793 -0.865507
C  0.253953 -3.183808 1.511827
C  -0.957312 -4.107658 1.491347
H  5.602932 -1.147925 1.49766
H  4.807944 0.092601 2.486331
H  -2.906763 1.963621 1.470215
H  -3.810579 0.707609 2.339934
H  2.705013 -2.014414 1.870707
H  -1.273282 -0.595497 1.249003
H  2.391413 1.005903 -2.155119
H  -4.446405 -1.010134 -2.655437
H  0.555815 -0.573844 -1.633694
H  7.54329 1.223371 1.663919
H  4.623027 2.498327 -2.256287
H  -2.390367 -2.423328 -2.550512
H  -5.678727 3.126571 2.087864
H  -6.472234 0.701057 -2.271521
H  -0.30461 -2.953025 -1.468106
H  8.28427 2.995524 0.04198
H  6.837403 3.625187 -1.897165
H  -7.711383 3.632204 0.696207
H  -8.100621 2.429516 -1.46094
H  -0.931959 -4.698742 2.41897
H  -0.940292 -4.786052 0.620759
H  -1.903647 -3.540927 1.443143
