program: Gaussian 09
title: /home/michael/molsimp_comfiles/Fe_3a1_10_OH/Fe_3a1_10_OH.com auto generated
version: ES64L-G09RevE.01
frameworkgroup: C1[X(C31H23FeN4O3)]
method: UTPSSh
basis: Gen
operation: Freq
keyword: #P
keyword: Geom=AllCheck
keyword: Guess=TCheck
keyword: SCRF=Check
keyword: GenChk
keyword: UTPSSh/ChkBas
keyword: Freq
title: /home/michael/molsimp_comfiles/Fe_3a1_10_OH/Fe_3a1_10_OH.com auto gene
converged: YES YES NO YES
polarizability: 6.56237507e+02 -1.64430809e+01 8.34542388e+02 3.07740358e+00 -2.09386225e+01 5.31016376e+02
1716.lowfreq: -11.2723 -0.0007 -0.0003 0.0007 7.9886 8.8281 17.1557 21.2392 28.6288
frequency: 16.7728 21.1144 28.5576 30.8771 35.5543 36.8803 58.8032 74.4673 108.7882 113.3546 122.7507 125.5102 143.4423 153.3719 157.3328 170.4737 175.6928 183.3693 185.1342 199.0685 216.1710 239.0459 245.5058 253.6283 281.2779 288.7773 290.9017 303.4418 316.3979 329.3464 352.8240 371.4924 383.3778 393.6399 395.0874 397.9339 440.1403 461.8702 474.9356 476.7916 478.3165 490.8901 495.1450 502.2942 524.1603 524.7783 525.9419 536.5890 539.5960 542.1816 547.7757 555.1674 590.8269 606.6656 617.2624 642.3165 642.6830 646.0016 650.0306 650.8194 659.5990 690.9768 732.2087 740.2416 742.2754 758.6190 761.3027 762.6389 766.4805 775.8945 776.7192 788.7584 789.8830 830.0067 831.5040 839.7887 841.8600 844.1790 846.5259 861.6553 862.1752 885.6859 886.3852 897.0803 930.8127 940.6301 946.5444 949.3992 963.7787 965.3335 972.8305 974.5092 985.0610 985.6377 986.7142 1006.3032 1015.3304 1016.5660 1040.3278 1040.3721 1040.5297 1057.4637 1066.0251 1070.8528 1075.2450 1097.0392 1153.6040 1156.6169 1156.7184 1171.5930 1174.4261 1174.9989 1179.6207 1195.1922 1196.7849 1237.2514 1246.8551 1247.8212 1252.8043 1279.4798 1280.2747 1280.4236 1287.6845 1289.9044 1293.2426 1319.5214 1347.1076 1368.1252 1376.5871 1381.0082 1402.5089 1407.1409 1407.7962 1431.4784 1432.4475 1438.4146 1465.9802 1472.4509 1473.8750 1485.3690 1494.4955 1495.4450 1500.5772 1525.5420 1543.9573 1545.2577 1566.7782 1595.4568 1608.1706 1608.9307 1630.8067 1641.2205 1642.4017 1650.0104 1673.1944 1673.8139 1675.4716 3187.4106 3189.8737 3194.5336 3199.4095 3199.6236 3203.6486 3204.2053 3205.9424 3206.4102 3213.7653 3213.9977 3218.2403 3218.3958 3221.1307 3224.2321 3224.6450 3225.9565 3231.0903 3234.4276 3256.5093 3262.9099 3616.7667 3763.6739
redmass: 5.9277 6.4850 4.3390 4.9562 4.9285 6.0345 5.0270 5.3745 5.1262 5.8384 6.5789 4.6910 6.2209 6.5064 7.5622 6.3854 6.6233 3.6283 3.7957 3.9666 3.5520 6.9953 5.8546 5.6079 6.3437 3.7681 7.9905 2.7596 6.9032 6.8832 7.7532 5.3411 4.5259 3.2260 3.5135 4.0589 1.4572 7.0431 2.6796 2.7367 2.5665 3.5572 4.0118 7.1950 8.3960 6.7699 7.7140 3.6266 7.3299 7.5527 4.2343 8.0262 8.2257 7.1057 4.9229 6.6616 6.5442 3.4769 3.4946 6.3654 5.5967 5.0191 2.1068 6.8039 2.6032 3.1008 1.2515 1.2748 1.4301 3.4669 3.5888 4.6919 4.7172 5.2341 6.0205 1.3729 1.4360 4.8298 1.4383 1.4088 1.2060 1.4044 1.3899 6.2759 1.5463 1.4677 1.3379 1.2425 5.0884 5.0447 1.3213 1.3163 1.2614 1.3784 1.3703 8.0868 1.3004 1.2980 2.0718 2.1389 2.3369 2.1203 2.5911 2.5505 3.6752 3.5970 1.5915 1.4954 1.4935 1.1483 1.1135 1.1132 1.3269 1.3512 1.3672 2.1500 2.1186 2.1126 2.2860 2.3415 1.6540 1.6383 2.3219 1.8631 1.8211 3.0642 4.3808 2.9555 3.4426 3.5830 6.2469 1.8241 1.7781 7.2530 7.3305 3.4968 2.5286 2.4897 2.4811 3.7610 2.0845 2.1007 2.9216 3.6054 3.2562 3.2829 6.2028 6.8427 6.5078 6.6084 6.6283 5.2252 5.2186 5.9725 6.1370 6.1720 9.2770 1.0873 1.0857 1.0892 1.0867 1.0866 1.0891 1.0891 1.0938 1.0927 1.0950 1.0951 1.0915 1.0913 1.0973 1.0982 1.0981 1.0916 1.0941 1.0917 1.0944 1.0939 1.0819 1.0663
irintensity: 0.8712 4.6192 0.3193 1.9465 1.2993 3.1196 1.1170 1.6912 2.6754 5.8000 3.1835 8.7277 2.0924 4.6781 0.0885 34.6681 6.6582 0.5102 0.3773 9.4564 6.7276 32.9748 33.1173 1.8385 41.4259 31.2794 29.5059 33.5838 71.1407 50.4162 56.4449 18.6728 6.6510 2.0632 6.4940 13.6981 148.9153 14.1331 22.5650 32.0462 50.9340 3.7597 25.1012 86.5741 193.2813 1.0106 150.9874 0.6809 13.9059 19.9949 11.9094 37.5042 10.9294 17.7231 5.9800 19.1557 7.6539 0.1863 22.2661 15.4912 2.4690 1.4710 23.0020 16.9946 86.7606 13.6518 21.5790 49.7140 90.4439 1.8443 9.2840 0.3357 0.7815 14.2738 2.9636 37.7675 102.1132 140.1474 11.7008 36.4287 133.8780 6.7379 18.8121 5.2443 9.7318 9.4632 5.2801 1.6241 0.3445 10.6283 0.1668 0.1905 0.3403 6.1918 6.0876 6.2349 0.0164 0.0109 8.4022 15.2758 12.5520 33.9767 73.4299 16.2406 60.0756 54.8328 66.2598 1.9550 4.3301 11.2116 4.6625 4.5131 2.5881 30.7152 23.0948 110.0969 18.8406 35.8081 117.1986 382.4356 41.0198 20.4742 60.1964 29.6797 20.3025 110.7382 138.8116 13.8049 0.2204 0.5952 219.8175 12.4541 76.9181 32.8843 30.2899 35.0171 160.1939 6.2387 1.5634 16.5982 9.0690 4.4511 425.4427 35.0684 7.3255 25.7021 98.7394 73.8398 3.9499 7.4097 43.4386 21.2246 18.4129 270.4561 58.4731 60.3062 242.1774 16.1752 7.8742 7.5214 1.7885 1.8009 0.5269 0.6085 43.2508 40.6457 30.7506 31.6801 5.3270 7.7053 43.0875 34.2615 33.0253 0.8062 18.9411 0.6704 16.5398 13.2431 268.2084 47.4815
temp: 298.150 k
press: 1.00000 atm
elementType: 26 8 6 6 6 6 6 6 6 7 6 6 6 6 6 8 6 7 1 1 1 1 1 1 1 1 8 1 7 6 6 6 6 6 6 6 6 6 1 1 1 1 1 1 1 7 6 6 6 6 6 6 6 6 6 1 1 1 1 1 1 1
symmnumber: 1
zpe: 1244813.3 jmol-1
zpe.correction: 0.474124 hartree
zpe.thermalcorrener: 0.505878 hartree
zpe.thermalcorrenthalpy: 0.506822 hartree
zpe.thermalcorrgfe: 0.409764 hartree
zpe.sumelectzpe: -1763.054734 hartree
zpe.sumelectthermal: -1763.022981 hartree
zpe.sumelectthermalent: -1763.022036 hartree
zpe.sumelectthermalfe: -1763.119094 hartree
dipole: 1.3956 4.5257 5.5212
dipole: 7.2742
quadrupole: -138.5204 -187.5068 -227.9124
quadrupole: -2.6991 -4.9446 17.3159
quadrupole: 46.1262 -2.8603 -43.2659 -2.6991 -4.9446 17.3159
hfenergy: -1763.5288583 hartree
pointgroup: C01 [X(C31H23Fe1N4O3)]
dipole: 0.6373884 1.7348551 2.1850569 debye
polarizability: 654.9711762|-6.6890243|836.0444894|2.2985356|-19.2075981|530.7806061 unknown
InChI: InChI=1S/C13H8N2O2.2C9H7N.Fe.H2O/c16-10-6-2-1-4-8(10)13-14-9-5-3-7-11(17)12(9)15-13;2*1-2-4-9-7-10-6-5-8(9)3-1;;/h1-7,14H;2*1-7H;;1H2/q-3;2*-1;+6;/p-1
charge 0 multiplicity 2
62 atoms
Fe 0.00572364 -0.26522411 -0.65553043
O  0.14207049 1.46146519 -1.55960089
C  0.08485855 2.71278499 -1.08403719
C  0.07221661 3.75787557 -2.0405252
C  0.04345678 5.0956202 -1.66541767
C  0.02294757 5.46207216 -0.30944394
C  0.02962068 4.46494103 0.65647386
C  0.05935292 3.09933478 0.30368625
C  0.0512859 2.05043772 1.29868931
N  0.05227349 2.11380827 2.68175182
C  0.02795928 0.8066586 3.19216168
C  0.01586448 0.16118115 4.44092649
C  -0.00562274 -1.24342351 4.38806154
C  -0.0125256 -2.02753633 3.20217996
C  0.00380875 -1.38041257 1.95331496
O  0.02220331 -1.86121576 0.6986537
C  0.01576312 0.01132056 2.05305879
N  0.02719621 0.77896222 0.93230756
H  0.09034205 3.47818647 -3.08994994
H  0.03559431 5.86186494 -2.43559914
H  -0.00125068 6.50680048 -0.0179773
H  0.00675674 4.7352238 1.70887407
H  0.06371481 2.9706718 3.22246588
H  0.02411779 0.69022529 5.38669221
H  -0.01594837 -1.7790622 5.33371838
H  -0.02529633 -3.11079069 3.27825768
O  -0.12851031 -1.29992453 -2.19960724
H  0.73841467 -1.34080203 -2.63592682
N  2.01745941 -0.41711093 -0.68805342
C  2.83767182 0.67178156 -0.52974266
C  4.20597823 0.56246147 -0.48145061
C  4.82281914 -0.71063915 -0.60023698
C  6.22686514 -0.91325431 -0.55832864
C  6.74193846 -2.18887697 -0.67714893
C  5.88719664 -3.31045225 -0.84210603
C  4.51908075 -3.14500417 -0.88671976
C  3.96335848 -1.84263862 -0.76622623
C  2.56580489 -1.62448169 -0.79831919
H  2.34336253 1.62945324 -0.44191284
H  4.81168735 1.45304819 -0.35007851
H  6.88172205 -0.05650042 -0.4317566
H  7.81626444 -2.34225569 -0.64404961
H  6.31966748 -4.30175436 -0.93278523
H  3.85416707 -3.99451742 -1.01140101
H  1.88561036 -2.46224062 -0.90789164
N  -1.99571703 -0.26884503 -0.6000927
C  -2.73739823 0.87586632 -0.45658132
C  -4.11045471 0.86661536 -0.45404817
C  -4.8124022 -0.35834803 -0.60092171
C  -6.22815885 -0.45636383 -0.61365253
C  -6.83146907 -1.68919055 -0.76346882
C  -6.0561536 -2.87000216 -0.90446327
C  -4.67877527 -2.80652511 -0.89454694
C  -4.03249668 -1.54986543 -0.7437693
C  -2.62205095 -1.43345077 -0.73570098
H  -2.17877685 1.79555876 -0.34734287
H  -4.65433529 1.79857997 -0.34076097
H  -6.82206466 0.44622774 -0.50634998
H  -7.91465693 -1.76238822 -0.77459508
H  -6.55668314 -3.82595668 -1.02113537
H  -4.07465582 -3.70249824 -1.00215695
H  -1.99669308 -2.31217542 -0.84446351
