program: Gaussian 09
title: /home/michael/molsimp_comfiles/Co_3a1_27_OOH/Co_3a1_27_OOH.com auto generated
version: ES64L-G09RevE.01
frameworkgroup: C1[X(C20H15CoN4O6)]
method: UTPSSh
basis: Gen
operation: Freq
keyword: #PGeom=AllCheck
keyword: Guess=TCheck
keyword: SCRF=Check
keyword: GenChk
keyword: UTPSSh/ChkBas
keyword: Freq
title: /home/michael/molsimp_comfiles/Co_3a1_27_OOH/Co_3a1_27_OOH.com auto ge
converged: YES YES YES YES
polarizability: 5.38474839e+02 3.84114437e+01 4.94411644e+02 -3.26539993e+01 -5.76076888e+01 4.19438265e+02
1716.lowfreq: -7.9810 0.0005 0.0009 0.0010 7.5652 13.3557 26.5582 31.6908 40.9264
frequency: 26.1637 31.6760 40.8626 44.1944 54.4930 69.8234 73.4599 89.8896 97.0169 114.5927 136.7959 149.9537 167.1208 175.6692 177.9627 196.2990 200.6133 210.3773 214.4761 243.7667 255.6347 276.2408 283.9740 287.1378 309.5297 351.0274 370.1625 387.6543 393.7878 396.4994 403.3357 415.2145 446.6319 460.8327 469.9493 474.3642 479.3848 504.0152 533.1483 536.5574 549.4135 570.1494 596.0622 636.2229 642.8065 651.6075 664.7123 686.8393 690.8288 694.2211 731.1831 766.6112 770.3867 772.5967 784.7881 792.2073 793.9022 802.1630 844.3660 847.5230 854.7223 876.0283 889.0394 892.9394 917.6004 960.4180 961.0616 974.0465 984.5376 994.2778 997.2437 1024.3889 1030.8964 1031.9318 1034.7162 1037.8610 1047.3888 1056.7180 1090.2129 1099.0631 1103.6907 1105.8858 1156.4241 1170.6963 1170.9962 1172.1237 1180.7739 1194.4135 1200.3440 1228.4926 1248.7937 1280.6787 1287.6971 1314.9655 1319.7005 1327.4288 1339.5086 1344.1072 1376.2935 1393.0591 1439.0786 1448.1399 1456.6563 1479.9129 1488.1062 1507.0571 1518.6128 1542.1822 1585.3043 1619.6110 1621.8989 1623.6817 1626.9449 1631.4880 1645.4579 1652.7329 1662.3315 3210.7313 3217.8257 3223.0314 3227.0132 3230.0287 3232.3656 3233.6254 3235.7853 3241.5185 3244.9719 3248.6362 3255.6681 3267.2257 3290.8580 3696.0070
redmass: 5.8829 4.9830 4.9042 5.2513 6.1396 6.8274 5.7383 11.7857 5.8292 10.1334 8.1013 6.1530 6.5082 4.4279 4.5169 5.8104 6.7919 8.5664 8.7226 8.6698 7.5590 9.5128 7.0046 6.9022 1.6143 8.1754 4.3403 6.4584 3.9130 2.9659 11.7785 5.4340 9.0273 4.8237 5.8369 4.2984 3.0955 4.0053 7.1229 10.4592 10.5638 12.0686 7.5256 7.3709 6.7397 6.3674 4.2247 7.2421 7.5305 1.7884 11.4626 1.3715 1.7347 1.8041 5.5499 3.8385 7.4169 13.1328 1.4330 5.1679 2.5429 1.2646 15.3527 1.4895 8.3501 1.3230 1.3963 5.3799 1.3323 1.4226 1.3576 1.3151 1.3476 1.3198 2.3037 6.5962 6.4581 4.1871 1.7010 2.1430 2.3871 2.0254 1.5060 1.1480 1.1712 1.1925 4.3690 1.4410 2.8136 1.1992 3.0958 3.4578 1.7333 1.1170 2.9089 7.5421 2.9419 9.4241 1.2356 5.2582 6.9243 3.3797 1.9769 2.2749 2.3237 3.0371 1.9789 3.0257 6.6796 11.2255 5.9391 5.9736 7.7922 8.5954 8.9661 5.4580 5.7115 1.0872 1.0897 1.0885 1.0956 1.0901 1.0931 1.0985 1.0914 1.0965 1.0932 1.0975 1.0951 1.0939 1.0938 1.0688
irintensity: 2.1355 11.2611 1.7655 5.9227 6.4602 8.6940 2.3561 22.1533 6.3919 2.9501 0.9167 6.8385 2.7278 5.8729 4.8198 17.4822 9.2788 13.3781 6.7517 4.8907 4.0347 36.5147 21.3232 0.1744 174.5840 23.2758 100.1725 16.9474 0.7389 2.7554 1.6035 9.7730 43.9976 32.6483 1.1466 20.2340 11.1539 5.2262 1.0013 38.0303 21.5983 11.2372 11.6897 11.1006 9.7988 1.7755 0.3247 66.9420 47.2490 90.7327 114.3378 65.4546 36.9253 49.1491 12.3926 9.5033 1.4948 31.9159 94.6360 5.0357 12.0123 0.2123 161.5280 1.7486 40.6048 2.2991 0.0332 1.9262 0.3482 0.1264 6.1495 0.0064 0.0823 0.0390 6.9264 12.0474 0.0922 12.4046 41.1948 65.8887 29.6701 1.0411 7.1627 13.6738 2.5439 5.7478 128.8516 5.0965 60.8335 28.5573 14.1069 15.7517 3.1935 65.4183 21.7557 14.6303 37.4932 953.4856 4.0478 38.1964 86.6192 8.4613 12.3006 53.7285 6.6947 18.7472 5.6370 31.9579 43.5599 2106.3330 234.6271 20.1952 81.2684 348.3866 170.7259 35.5138 4.4198 0.3034 4.6657 3.3641 16.6772 1.9418 0.8922 18.5338 2.9806 1.7221 0.5310 0.2867 5.4328 11.1119 5.9219 95.7834
temp: 298.150 k
press: 1.00000 atm
elementType: 27 8 6 8 6 6 6 6 6 6 8 8 7 1 1 1 8 8 1 7 6 6 6 6 6 6 6 6 7 1 1 1 1 1 1 7 6 6 6 6 6 1 1 1 1 1
symmnumber: 1
zpe: 867977.7 jmol-1
zpe.correction: 0.330595 hartree
zpe.thermalcorrener: 0.357059 hartree
zpe.thermalcorrenthalpy: 0.358003 hartree
zpe.thermalcorrgfe: 0.273534 hartree
zpe.sumelectzpe: -1586.363567 hartree
zpe.sumelectthermal: -1586.337104 hartree
zpe.sumelectthermalent: -1586.336159 hartree
zpe.sumelectthermalfe: -1586.420628 hartree
dipole: -0.2539 6.9447 3.9323
dipole: 7.9847
quadrupole: -75.2780 -150.3048 -231.0190
quadrupole: -16.5008 12.9136 9.4234
quadrupole: 76.9226 1.8958 -78.8184 -16.5008 12.9136 9.4234
hfenergy: -1586.6941622 hartree
pointgroup: C01 [X(C20H15Co1N4O6)]
dipole: 3.0055181 0.0812546 0.9103816 debye
polarizability: 431.6683626|73.0769492|509.1077156|-28.2921541|-35.7460853|511.5486698 unknown
InChI: InChI=1S/C8H6N2.C7H3NO4.C5H5N.Co.H2O2/c1-2-4-8-7(3-1)5-6-9-10-8;9-6(10)4-2-1-3-5(8-4)7(11)12;1-2-4-6-5-3-1;;1-2/h1-6H;1-3H;1-5H;;1-2H/q-1;-3;-1;+6;/p-1
charge 0 multiplicity 1
46 atoms
Co -0.04994179 0.0070333 0.4421844
O  2.40312718 -3.11589891 0.62910385
C  1.83863548 -2.00961924 0.57644485
O  0.5428455 -1.85214831 0.51768349
C  2.61275798 -0.71781782 0.575412
C  3.99124421 -0.5148735 0.61989428
C  4.46477551 0.80398379 0.5989475
C  3.57562153 1.88448485 0.53410142
C  2.21005424 1.6049462 0.49310265
C  1.04137821 2.55568678 0.42794126
O  -0.12549839 1.95718941 0.40060135
O  1.19183903 3.78742042 0.40497301
N  1.79174635 0.33493054 0.51750011
H  4.66863691 -1.35927456 0.6682535
H  5.53253102 0.99012456 0.63281862
H  3.92671 2.90946888 0.51691611
O  -1.89694135 -0.37493765 0.39941941
O  -2.62590182 0.60970151 -0.38486259
H  -2.61478264 0.22216214 -1.28004057
N  -0.21908812 -0.02602536 2.40547471
C  0.22083673 0.9595358 3.23594179
C  0.02944558 0.89170798 4.59935929
C  -0.63473916 -0.22723541 5.1330093
C  -0.90496628 -0.42641392 6.51224937
C  -1.56390295 -1.5669197 6.91653274
C  -1.97717441 -2.55001835 5.97372679
C  -1.73080374 -2.38781102 4.62969112
C  -1.05413138 -1.21836842 4.18642855
N  -0.83368742 -1.08525784 2.85070211
H  0.71975578 1.79890899 2.77617593
H  0.38581472 1.69295711 5.23731944
H  -0.58761215 0.32575233 7.22704388
H  -1.77426491 -1.72493244 7.96934323
H  -2.49350225 -3.43684401 6.32615086
H  -2.03902896 -3.12533333 3.8964753
N  -0.0053711 -0.13398992 -1.53490508
C  0.46843649 0.82028741 -2.36121481
C  0.47244925 0.66482966 -3.74429367
C  -0.03413654 -0.51119522 -4.2977414
C  -0.53238936 -1.49326094 -3.44004543
C  -0.50169943 -1.27306789 -2.06693548
H  0.84618004 1.7280966 -1.9116307
H  0.86691322 1.46145991 -4.36428729
H  -0.0425511 -0.65811715 -5.3725883
H  -0.94133065 -2.42327399 -3.8177469
H  -0.87682306 -2.00467927 -1.36325599
