program: Gaussian 09
title: /home/michael/molsimp_comfiles/Co_3a1_27_VAC/Co_3a1_27_VAC.com auto generated
version: ES64L-G09RevE.01
frameworkgroup: C1[X(C20H14CoN4O4)]
method: UTPSSh
basis: Gen
operation: Freq
keyword: #P
keyword: Geom=AllCheck
keyword: Guess=TCheck
keyword: SCRF=Check
keyword: GenChk
keyword: UTPSSh/ChkBas
keyword: Freq
title: /home/michael/molsimp_comfiles/Co_3a1_27_VAC/Co_3a1_27_VAC.com auto ge
converged: YES YES YES YES
polarizability: 4.68546968e+02 5.41759163e+01 4.18561250e+02 -1.11313188e+01 -6.51415513e+01 3.46653599e+02
1716.lowfreq: -12.6143 0.0006 0.0007 0.0009 8.6861 10.1048 15.5371 21.7455 24.3364
frequency: 14.8614 18.7342 19.6753 26.8823 31.8094 50.5995 62.6215 75.1911 96.0395 104.7900 120.6668 127.8253 144.3090 168.8437 173.9631 181.1330 184.7030 192.3365 214.5765 231.1450 239.1925 272.8443 289.0756 371.9076 381.8046 384.5885 389.4162 417.7389 432.1437 444.9449 475.9129 476.8788 484.5708 523.0933 530.2517 531.5429 580.8104 631.0225 637.8693 651.9937 660.4920 665.3485 691.9173 709.1978 712.4870 765.9601 767.8112 769.9057 782.5031 797.3378 797.4230 808.3315 837.0645 858.1755 867.1037 894.9648 897.9611 912.9145 957.3846 972.2450 974.1258 988.5709 1002.9680 1004.1105 1021.1390 1026.5114 1030.2747 1031.0519 1033.6983 1037.1853 1044.2421 1089.1656 1089.9728 1090.6367 1094.0355 1154.1563 1168.3205 1168.9058 1170.0621 1178.2935 1194.7721 1211.9189 1230.6911 1238.7872 1282.3095 1305.7656 1319.8212 1322.3759 1332.7447 1377.1628 1382.0344 1387.9932 1438.2476 1444.5161 1450.6918 1478.0281 1482.8293 1496.9780 1517.8023 1537.7592 1565.9075 1576.6547 1585.7101 1619.3426 1622.3924 1623.0579 1639.5342 1651.7306 1663.6296 3208.7058 3214.9164 3215.6156 3220.7406 3223.8071 3224.1542 3227.3840 3228.0385 3231.1721 3236.2959 3239.1422 3241.1084 3243.1972 3253.8519
redmass: 4.9429 4.3226 6.0261 5.7512 7.4137 6.8764 8.3665 8.1495 6.4376 8.0106 6.0960 6.9895 10.5050 5.1143 4.1431 7.4276 10.0728 10.6136 7.6192 12.0525 19.6792 17.1625 7.2930 13.4598 4.2471 3.8480 2.6876 10.5753 3.9871 4.0615 6.0959 3.2274 3.4899 10.9673 7.2971 7.9809 7.3286 6.8665 7.3196 6.3197 4.5557 7.8298 7.5999 1.7085 10.0235 1.2999 1.7714 1.8073 5.5671 3.7252 12.5592 7.9623 5.8810 2.6983 1.3243 1.5113 1.2457 8.1132 1.4041 1.3077 5.2992 1.3243 1.3582 1.4326 1.3125 1.3378 1.3146 6.9629 2.2925 7.5019 5.8412 1.7412 2.7850 1.7696 1.5962 1.4796 1.2689 1.1491 1.0829 1.3809 6.5442 2.1367 1.2330 2.8938 1.8249 2.5818 8.8191 8.1445 2.9792 9.1008 1.2284 5.1256 5.8024 3.8804 2.0903 2.2199 2.4158 2.9257 1.9437 3.1473 12.8370 10.7498 6.8238 5.4076 7.3235 5.8430 6.9157 5.2003 5.8090 1.0870 1.0879 1.0892 1.0897 1.0881 1.0956 1.0919 1.0933 1.0988 1.0961 1.0927 1.1001 1.0968 1.0960
irintensity: 4.3970 0.4200 4.2953 1.8547 3.5912 0.5920 31.8077 12.2937 0.5494 0.9311 3.7762 5.8019 1.6070 1.0197 10.5905 1.2783 27.5856 53.3627 34.0022 76.3027 73.7521 35.0263 0.7538 1.1061 6.4301 4.0875 0.1096 26.6051 18.1711 18.6432 0.5941 11.5113 0.5450 5.3028 3.9373 3.9998 4.8420 11.8112 5.3859 0.4699 1.1843 31.4518 68.1063 107.3964 141.4303 67.7293 56.6915 29.1277 15.6464 5.3791 29.0129 0.2916 9.1850 9.2972 70.3896 9.4565 0.0297 44.3113 0.1443 1.5994 0.8335 2.3390 2.3392 0.0373 0.0206 0.4247 0.2662 16.7783 6.9016 29.1516 8.3714 19.0801 22.0476 2.9549 46.6590 6.7102 17.3936 0.0758 3.8020 4.4504 79.5695 0.3986 15.8602 24.6009 0.5884 20.6286 168.2262 1.5368 12.0334 975.2121 3.6875 29.9721 59.7586 118.1780 12.7986 66.4485 18.6941 0.2718 5.8873 17.7852 1867.5858 771.8346 3.2784 7.4326 33.9314 60.5518 10.9466 55.9269 4.5819 0.2380 3.3939 3.5488 4.9619 0.4937 18.9805 1.2724 2.3184 20.5079 20.6605 0.6258 5.6804 2.8381 2.5764
temp: 298.150 k
press: 1.00000 atm
elementType: 27 8 6 8 6 6 6 6 6 6 8 8 7 1 1 1 7 6 6 6 6 6 6 6 6 7 1 1 1 1 1 1 7 6 6 6 6 6 1 1 1 1 1
symmnumber: 1
zpe: 814068.2 jmol-1
zpe.correction: 0.310062 hartree
zpe.thermalcorrener: 0.335165 hartree
zpe.thermalcorrenthalpy: 0.336109 hartree
zpe.thermalcorrgfe: 0.249067 hartree
zpe.sumelectzpe: -1435.442576 hartree
zpe.sumelectthermal: -1435.417473 hartree
zpe.sumelectthermalent: -1435.416529 hartree
zpe.sumelectthermalfe: -1435.503571 hartree
dipole: -4.4895 -2.9004 -2.4463
dipole: 5.8781
quadrupole: -76.2356 -147.9980 -224.3947
quadrupole: -17.9683 2.3270 31.4103
quadrupole: 73.3071 1.5448 -74.8519 -17.9683 2.3270 31.4103
hfenergy: -1435.7526378 hartree
pointgroup: C01 [X(C20H14Co1N4O4)]
dipole: -2.0899463 -0.2012072 0.969456 debye
polarizability: 373.8148983|72.6506692|448.6843536|-64.3605413|-15.3344686|411.2625647 unknown
InChI: InChI=1S/C8H6N2.C7H3NO4.C5H5N.Co/c1-2-4-8-7(3-1)5-6-9-10-8;9-6(10)4-2-1-3-5(8-4)7(11)12;1-2-4-6-5-3-1;/h1-6H;1-3H;1-5H;/q-1;-2;-1;+4
charge 0 multiplicity 4
43 atoms
Co 0.25887328 0.00072761 0.64758567
O  3.19000945 -3.03365752 0.32652751
C  2.49466785 -1.99683647 0.47546873
O  1.25285319 -1.97103034 0.80872205
C  3.13946739 -0.64000039 0.27648375
C  4.49373086 -0.41106902 0.02398553
C  4.93332859 0.91200087 -0.0896962
C  4.0263568 1.9659018 0.06025992
C  2.68772891 1.65557429 0.30766837
C  1.57698037 2.65988632 0.5333957
O  0.42346929 2.1523005 0.80076964
O  1.83397933 3.88735401 0.46659394
N  2.28174851 0.38196728 0.39441958
H  5.18011328 -1.24418534 -0.07174356
H  5.98022303 1.12086317 -0.28317637
H  4.34498811 2.99955666 -0.00624273
N  -0.19360933 -0.08370621 2.73913122
C  0.36579472 0.71008157 3.69226024
C  0.02904255 0.6027658 5.0257689
C  -0.93155529 -0.35719434 5.39721999
C  -1.37920551 -0.57803055 6.72734845
C  -2.3250534 -1.54849193 6.97562654
C  -2.86281556 -2.33627446 5.91889443
C  -2.45126638 -2.14738388 4.6197231
C  -1.47638057 -1.15174561 4.33577772
N  -1.09159034 -0.99581629 3.03835776
H  1.08991319 1.427281 3.32648584
H  0.49378339 1.24522296 5.76606797
H  -0.96601686 0.02465131 7.52985274
H  -2.66952776 -1.72102454 7.99023094
H  -3.60529476 -3.09375973 6.14783734
H  -2.84895671 -2.73839118 3.80124332
N  0.03273798 -0.1844878 -1.49138002
C  0.07771444 0.89878928 -2.29562058
C  0.0419459 0.80191277 -3.68400115
C  -0.04389478 -0.46310818 -4.26943239
C  -0.09534771 -1.58608085 -3.44075472
C  -0.05397004 -1.40579306 -2.06059755
H  0.14526414 1.86034491 -1.79888362
H  0.08304674 1.70235972 -4.28649851
H  -0.0700204 -0.5714804 -5.34888162
H  -0.16326133 -2.58787021 -3.84975894
H  -0.08417656 -2.24851255 -1.37906692
