program: Gaussian 09
title: /home/michael/molsimp_comfiles/Ru_31a_27_VAC/Ru_31a_27_VAC.com auto generated
version: ES64L-G09RevE.01
frameworkgroup: C1[X(C20H14N4O4Ru)]
method: UTPSSh
basis: Gen
operation: Freq
keyword: #P
keyword: Geom=AllCheck
keyword: Guess=TCheck
keyword: SCRF=Check
keyword: GenChk
keyword: UTPSSh/ChkBas
keyword: Freq
title: /home/michael/molsimp_comfiles/Ru_31a_27_VAC/Ru_31a_27_VAC.com auto ge
converged: YES YES NO YES
polarizability: 8.04758476e+02 1.01152580e+01 4.31570116e+02 -2.84475145e+01 3.95647339e+01 4.08657305e+02
1716.lowfreq: -5.3555 0.0004 0.0007 0.0009 10.9940 15.0342 26.1325 30.0166 33.9720
frequency: 17.9445 26.4330 33.4175 38.8429 47.3066 59.0930 77.8847 95.1435 132.5387 160.5681 161.6990 173.1077 181.6084 198.0881 208.5182 223.7293 239.3233 246.6945 258.8217 288.2098 315.0137 321.9528 341.8234 386.8755 396.6740 401.1253 406.6920 425.7147 461.5059 463.5378 472.6968 496.4455 514.6031 531.2375 543.1685 545.6250 589.9460 636.8055 647.2765 655.0511 668.7966 683.9498 694.3292 697.7464 717.5303 765.0095 768.7939 775.3449 783.1237 785.5991 794.6234 800.2146 846.0152 849.9936 856.3052 873.1840 887.5426 911.7316 951.0181 959.0613 971.6481 979.4579 990.4085 994.5462 1013.1577 1015.4690 1018.7568 1029.2410 1036.7851 1051.0999 1054.7384 1078.2437 1085.3329 1100.1442 1100.7159 1154.2283 1167.0763 1168.0225 1168.9183 1175.1338 1180.7767 1199.4169 1225.9380 1236.8611 1286.2458 1287.4861 1308.0380 1315.2045 1327.2607 1331.7107 1364.8708 1377.4569 1423.8860 1430.7291 1450.4274 1479.2071 1481.3132 1499.5079 1511.8769 1537.1717 1572.4551 1575.4047 1585.9332 1600.6128 1609.4290 1628.5267 1639.0444 1649.8141 1660.2763 3204.5095 3210.2518 3219.7264 3220.8755 3225.6997 3226.0139 3227.9417 3231.3680 3237.2038 3238.3684 3243.0319 3255.6559 3257.3207 3264.4466
redmass: 4.7526 7.5904 5.9306 5.1180 5.0355 6.1749 11.0838 6.7210 7.8095 6.5352 7.7434 4.9166 4.3940 7.4699 6.8695 7.3111 6.7559 9.9155 9.6302 7.2424 11.8083 10.7968 12.7070 3.6795 12.2008 2.7650 5.2253 9.5340 5.8652 3.9821 3.0810 4.1135 3.9083 7.0140 8.9480 9.5004 6.9858 7.3848 6.3619 6.6681 4.3190 7.4455 2.0644 5.0412 11.0195 1.3976 1.6940 1.7776 5.3875 3.7921 8.3062 12.5416 5.2941 3.0133 1.3640 1.2572 1.4977 8.3073 1.3263 1.3921 4.9512 1.3268 1.3998 1.3452 1.3008 1.3329 1.3005 6.4071 2.3594 6.0669 5.8707 2.8845 1.7672 1.7330 2.1442 1.5535 1.2260 1.2588 1.0787 5.6032 1.3798 2.4008 1.2017 2.7878 1.7780 4.6932 2.6136 7.1220 3.2294 11.7581 5.1774 1.2300 3.2081 7.0163 1.9498 2.2790 2.3422 2.9688 1.9150 2.9942 12.6473 6.7028 10.3582 6.8615 5.2719 5.8119 6.6425 5.3412 5.7701 1.0869 1.0892 1.0950 1.0878 1.0917 1.0888 1.0985 1.0913 1.0927 1.0971 1.0976 1.0950 1.0955 1.0949
irintensity: 2.8787 4.6641 3.5089 2.0529 0.2101 2.0520 28.3184 5.7047 2.8215 21.0671 12.2314 3.3140 17.1218 6.2212 11.3249 8.1550 9.2844 7.1825 14.8595 0.4393 5.6843 40.7534 68.5665 2.7111 3.6397 0.0357 27.3740 23.8093 1.0042 14.8519 9.1237 7.4490 5.4111 10.2502 39.1264 21.4532 12.1483 2.7540 1.7056 19.9085 2.2073 27.4861 91.5229 42.4265 114.2825 63.4648 49.1849 49.8858 3.4692 9.6403 0.3362 21.3211 19.4259 7.2570 81.1754 0.6079 8.9222 35.0519 1.8615 0.0341 16.7406 2.6520 0.2409 2.1850 0.0121 0.5303 0.0461 20.7852 3.0874 75.4588 79.6900 216.2547 3.9411 2.1805 70.3682 19.6806 0.8809 2.5477 2.4139 208.1836 45.1106 17.1646 0.4533 13.8712 12.5041 35.2674 25.5704 1.3423 35.7737 600.4702 9.2349 2.1706 64.4886 14.8208 34.6032 69.4786 61.4421 11.0512 65.0373 102.0756 2429.9133 678.8792 664.4847 61.8207 2.4867 114.2208 101.3784 12.5125 14.8492 2.5622 4.0094 21.2670 0.3162 2.4820 0.3692 40.9084 4.0084 0.2268 6.0803 7.1379 1.8508 3.8398 7.1843
temp: 298.150 k
press: 1.00000 atm
elementType: 44 8 6 8 6 6 6 6 6 6 8 8 7 1 1 1 7 6 6 6 6 6 6 6 6 7 1 1 1 1 1 1 7 6 6 6 6 6 1 1 1 1 1
symmnumber: 1
zpe: 818754.6 jmol-1
zpe.correction: 0.311847 hartree
zpe.thermalcorrener: 0.335501 hartree
zpe.thermalcorrenthalpy: 0.336446 hartree
zpe.thermalcorrgfe: 0.256383 hartree
zpe.sumelectzpe: -1384.253296 hartree
zpe.sumelectthermal: -1384.229642 hartree
zpe.sumelectthermalent: -1384.228698 hartree
zpe.sumelectthermalfe: -1384.308760 hartree
dipole: 6.9122 9.0745 -0.0433
dipole: 11.4073
quadrupole: -106.2911 -140.8900 -240.8338
quadrupole: -1.2818 6.4074 -6.6855
quadrupole: 56.3805 21.7817 -78.1621 -1.2818 6.4074 -6.6855
hfenergy: -1384.5651433 hartree
pointgroup: C01 [X(C20H14N4O4Ru1)]
dipole: -3.5632616 -0.051078 2.7280712 debye
polarizability: 781.4369204|37.8907428|415.7363756|82.729994|51.3186976|447.8126018 unknown
InChI: InChI=1S/C8H6N2.C7H3NO4.C5H5N.Ru/c1-2-4-8-7(3-1)5-6-9-10-8;9-6(10)4-2-1-3-5(8-4)7(11)12;1-2-4-6-5-3-1;/h1-6H;1-3H;1-5H;/q-1;-3;-1;+5
charge 0 multiplicity 1
43 atoms
Ru -0.05197451 0.18087057 0.46782293
O  2.10292725 3.72805847 0.65954163
C  1.64333886 2.56499348 0.62122866
O  0.36924642 2.28527291 0.60993072
C  2.57611242 1.37983008 0.58229545
C  3.96997458 1.41620315 0.58606686
C  4.67301565 0.20800947 0.51308155
C  3.97898846 -1.00545927 0.42295463
C  2.58593188 -0.97989815 0.42083044
C  1.66374851 -2.16507773 0.27086227
O  0.38931638 -1.89242574 0.22057473
O  2.13273803 -3.32089403 0.17833646
N  1.93119672 0.19666629 0.51302665
H  4.48578534 2.36799172 0.6409869
H  5.75736889 0.21176027 0.51714226
H  4.50317447 -1.95144659 0.3496138
N  -2.10312805 0.18209499 0.29375231
C  -2.94495431 0.70246566 1.24587404
C  -4.30682775 0.7426061 1.07313343
C  -4.85389995 0.23922654 -0.12745997
C  -6.23798978 0.22288547 -0.43548431
C  -6.66503671 -0.28974542 -1.64320436
C  -5.73145442 -0.80166999 -2.58415393
C  -4.37989413 -0.79918283 -2.31396128
C  -3.91520455 -0.27742758 -1.07646794
N  -2.57116535 -0.3015008 -0.84137564
H  -2.45663235 1.09123914 2.13036763
H  -4.94340184 1.1622916 1.84496683
H  -6.94347844 0.61712566 0.28939908
H  -7.72345829 -0.30494295 -1.88262059
H  -6.09258904 -1.19955021 -3.52715692
H  -3.65648878 -1.18773561 -3.02335668
N  -0.16591156 -0.09900427 2.45501121
C  0.31604914 0.7884912 3.36145505
C  0.21642557 0.57375385 4.73149993
C  -0.40089366 -0.58615901 5.20313981
C  -0.90159848 -1.49665455 4.2704287
C  -0.76774947 -1.22772698 2.91344226
H  0.77523712 1.68293431 2.96337373
H  0.61980744 1.31767523 5.40920838
H  -0.49077931 -0.77437068 6.26754291
H  -1.39317776 -2.41250189 4.57847842
H  -1.13609465 -1.90803089 2.15597799
