program: Gaussian 09
title: /home/michael/molsimp_comfiles/Ru_31a_9_OH/Ru_31a_9_OH.com auto generated
version: ES64L-G09RevE.01
frameworkgroup: C1[X(C26H20N5O3Ru)]
method: UTPSSh
basis: Gen
operation: Freq
keyword: #P
keyword: Geom=AllCheck
keyword: Guess=TCheck
keyword: SCRF=Check
keyword: GenChk
keyword: UTPSSh/ChkBas
keyword: Freq
title: /home/michael/molsimp_comfiles/Ru_31a_9_OH/Ru_31a_9_OH.com auto genera
converged: YES YES YES YES
polarizability: 8.49323508e+02 -5.52911898e+01 7.03540115e+02 -6.67126217e+00 5.25477714e+01 4.20776245e+02
1716.lowfreq: -0.0004 0.0005 0.0007 3.3668 4.7568 12.5936 19.7325 22.4636 30.8971
frequency: 19.6041 22.3596 30.7713 36.4325 41.6457 58.3383 68.2313 75.3107 103.4823 119.3055 129.5115 135.4673 159.6039 173.0313 176.8746 181.2618 185.7270 190.0357 219.8814 227.0743 236.4361 253.6161 270.3471 286.9595 300.1305 305.6695 320.1303 328.2021 359.1783 368.8729 390.3527 397.4086 407.5048 448.1499 460.8606 476.0337 479.4828 492.0783 499.9845 509.7530 514.8649 530.7968 538.5535 541.8747 550.4617 559.3267 597.8806 620.8678 630.1730 637.7609 640.0749 647.5071 651.3328 662.8808 672.8875 688.0373 704.0043 734.2220 735.4877 744.2219 761.7799 767.5723 768.7294 771.3881 783.1688 790.5087 842.6241 843.9693 851.0836 859.8060 866.5018 883.8931 886.7802 889.8465 896.8155 949.9172 952.8355 963.8516 972.4597 983.3534 986.3194 996.6192 997.6613 1015.8714 1018.2175 1024.8647 1032.6505 1035.2450 1041.7468 1049.4049 1063.9613 1068.6277 1082.3219 1087.9406 1097.4882 1101.5188 1152.4413 1153.7153 1168.3632 1169.2981 1177.1549 1179.9077 1180.5464 1220.7932 1231.3759 1237.2545 1251.7069 1261.9644 1283.4009 1294.6779 1308.7891 1321.5350 1322.4282 1328.9681 1346.0259 1369.2609 1381.2404 1399.6851 1433.1606 1439.6403 1448.9484 1464.5966 1478.4777 1481.0046 1484.1930 1504.3990 1518.6142 1525.7328 1537.5349 1570.5084 1580.3700 1597.4987 1617.7802 1627.7985 1630.7154 1648.4410 1651.2830 1661.5034 1668.8323 3189.3817 3193.7080 3198.3456 3205.3439 3207.6353 3208.9092 3211.7505 3217.9245 3220.8372 3221.8471 3224.7042 3229.0116 3229.8849 3231.1474 3234.8554 3244.9426 3249.0168 3255.6866 3623.4556 3737.8928
redmass: 6.1157 6.1210 5.0160 5.3043 5.8781 3.8617 5.3715 5.3384 5.4707 5.5856 5.4175 6.1152 6.2805 6.8562 6.5634 4.2585 6.2934 5.2076 6.6262 7.6862 5.6434 6.7228 9.5705 5.9072 5.8123 4.6039 1.9767 4.0335 7.2634 6.1798 3.5800 2.7352 4.6451 1.6071 3.8710 3.0533 2.6327 5.7447 7.0131 6.9785 4.9990 7.0137 3.5921 7.6675 4.1150 7.6728 7.0659 4.9862 8.4661 7.3182 6.8670 6.6435 6.3251 5.6597 4.2718 4.7279 1.7196 2.1976 5.7483 2.6876 2.8968 1.3590 1.4464 1.8108 5.5392 3.9186 6.4292 5.6038 1.4281 1.3695 1.4511 1.1356 1.2476 1.5065 5.9738 1.3430 1.2448 1.3165 4.8707 1.3265 1.2658 1.3631 1.4063 8.0545 1.3044 1.3064 6.7575 2.3009 1.8878 6.5291 4.3655 2.1371 3.4794 1.7269 3.8068 1.7522 1.7586 1.5018 1.2406 1.0782 1.1938 1.2876 1.3676 2.6597 1.3091 2.8118 1.6544 3.1144 1.7873 2.2571 2.6893 2.7590 7.3754 3.0755 3.4756 3.0780 1.2297 5.6551 6.0270 3.3476 2.0378 2.3981 2.2721 2.3602 3.7649 2.7077 1.9350 3.3591 3.0640 6.2264 6.5646 6.8714 5.3446 5.8722 6.5528 5.4630 5.2665 5.8164 9.0703 1.0872 1.0856 1.0890 1.0871 1.0926 1.0937 1.0892 1.0880 1.0950 1.0981 1.0920 1.0985 1.0895 1.0942 1.0946 1.0951 1.0972 1.0958 1.0822 1.0666
irintensity: 1.7186 4.8936 2.6118 5.8147 3.7991 0.7311 1.4508 0.8306 1.8404 1.5090 9.5536 16.3822 5.9963 12.9989 6.5366 13.2336 0.4305 2.5731 12.7368 4.1397 4.1020 10.5384 13.5603 1.4400 32.1444 97.0875 114.5232 6.6430 27.0557 70.4988 3.1811 0.4893 23.9400 83.4726 12.1753 3.4795 118.6966 44.3596 198.1256 101.1190 88.9368 4.7698 1.8900 16.1852 5.8002 19.0487 1.3123 8.0510 51.2763 2.0966 0.8626 11.0754 0.6865 9.2608 0.7211 2.5873 89.5159 32.2903 20.3430 74.4009 14.1865 125.7260 16.7624 52.7528 4.6186 6.1221 127.9772 10.4955 9.4423 85.4427 4.1370 118.9592 0.0409 7.1583 4.0497 6.4221 1.1902 2.7767 9.4007 2.2918 0.2546 1.8514 0.3286 2.3162 0.0012 0.0410 2.3006 2.0447 14.0943 0.6973 79.7321 22.5287 199.8653 23.2805 47.0375 4.5170 58.5266 11.2186 6.9158 2.5707 3.1110 6.2357 29.1318 187.5747 20.0786 23.7168 15.6126 571.6425 5.2561 6.2568 23.0252 42.8156 5.5252 20.8386 85.2393 12.3831 4.5454 236.3947 37.9251 42.5584 26.9091 130.5013 61.5299 17.0805 17.7753 370.6234 13.5097 5.8469 53.8945 63.2703 102.3200 62.8257 3.0148 51.3592 73.3507 122.6614 15.3606 3.0980 211.9070 16.7419 8.3270 5.8694 0.9417 42.6062 37.2014 3.8650 2.3942 19.6561 51.1991 2.3729 32.6465 1.1860 21.0417 3.7083 12.4721 9.6042 4.2145 309.2340 40.3590
temp: 298.150 k
press: 1.00000 atm
elementType: 44 8 6 6 6 6 6 6 6 7 6 6 6 6 6 8 6 7 1 1 1 1 1 1 1 1 7 6 6 6 6 6 6 6 6 7 1 1 1 1 1 1 7 6 6 6 6 6 1 1 1 1 1 8 1
symmnumber: 1
zpe: 1089699.4 jmol-1
zpe.correction: 0.415045 hartree
zpe.thermalcorrener: 0.443990 hartree
zpe.thermalcorrenthalpy: 0.444934 hartree
zpe.thermalcorrgfe: 0.353867 hartree
zpe.sumelectzpe: -1595.930413 hartree
zpe.sumelectthermal: -1595.901468 hartree
zpe.sumelectthermalent: -1595.900524 hartree
zpe.sumelectthermalfe: -1595.991591 hartree
dipole: 0.1515 4.8695 11.2866
dipole: 12.2932
quadrupole: -108.3387 -206.3548 -195.3280
quadrupole: 1.5706 9.8967 1.6162
quadrupole: 61.6684 -36.3476 -25.3208 1.5706 9.8967 1.6162
hfenergy: -1596.3454579 hartree
pointgroup: C01 [X(C26H20N5O3Ru1)]
dipole: -1.3985267 -2.6132234 3.821918 debye
polarizability: 807.6927566|-72.277513|734.1741573|90.070048|-17.5651837|431.772954 unknown
InChI: InChI=1S/C13H8N2O2.C8H6N2.C5H5N.H2O.Ru/c16-10-6-2-1-4-8(10)13-14-9-5-3-7-11(17)12(9)15-13;1-2-4-8-7(3-1)5-6-9-10-8;1-2-4-6-5-3-1;;/h1-7,14H;1-6H;1-5H;1H2;/q-3;2*-1;;+6/p-1
charge 0 multiplicity 2
55 atoms
Ru -0.24728346 -0.05229297 0.54383896
O  -0.11031819 -2.06402225 0.48064609
C  1.02124525 -2.80464677 0.42249536
C  0.81209261 -4.18089542 0.1732523
C  1.8593997 -5.09270113 0.1161709
C  3.1811848 -4.66641275 0.31179117
C  3.42592072 -3.32209257 0.55939759
C  2.38383871 -2.37181152 0.61888931
C  2.67176579 -0.9760629 0.88498657
N  3.86140754 -0.32650163 1.1843293
C  3.59543988 1.03976559 1.365664
C  4.30139755 2.21719783 1.67044122
C  3.51949261 3.3827878 1.73601159
C  2.11481027 3.45033551 1.52533849
C  1.40567303 2.27446152 1.22407693
O  0.08748309 2.07717053 1.00090302
C  2.22364958 1.14237262 1.16389457
N  1.70204711 -0.07823253 0.87371315
H  -0.21298353 -4.50865667 0.02696482
H  1.64500404 -6.13908082 -0.08059798
H  4.00446273 -5.37172283 0.26954489
H  4.44865393 -2.98771305 0.70940683
H  4.76509818 -0.77581061 1.27063656
H  5.37034471 2.24449196 1.84696841
H  4.02863239 4.31405653 1.96989658
H  1.60985757 4.40870909 1.60325347
N  -2.30558825 -0.0889251 0.17119781
C  -3.04531776 -1.1428358 0.63842139
C  -4.39253688 -1.25822337 0.3888383
C  -5.02495709 -0.25338939 -0.37179016
C  -6.40306951 -0.24730951 -0.70981202
C  -6.91767392 0.78881575 -1.45996289
C  -6.08444699 1.85428451 -1.89841293
C  -4.74303436 1.87720767 -1.58615317
C  -4.18729048 0.81934071 -0.81629428
N  -2.8535715 0.87624728 -0.53309735
H  -2.48777446 -1.87707455 1.20591194
H  -4.94971265 -2.10775852 0.76945792
H  -7.03230965 -1.06447364 -0.37114243
H  -7.97059208 0.79679332 -1.72286645
H  -6.51627447 2.6566853 -2.48784481
H  -4.0938191 2.68199735 -1.91511272
N  -0.6855858 -0.218371 2.62830102
C  -1.58443938 0.62716124 3.18162077
C  -1.90126311 0.59390481 4.53583322
C  -1.27373724 -0.34543749 5.35681441
C  -0.3468243 -1.21943061 4.78579745
C  -0.07772869 -1.12682467 3.42335661
H  -2.04568586 1.3404561 2.50897488
H  -2.62898054 1.29455989 4.9294639
H  -1.50124882 -0.39410718 6.41652112
H  0.16949797 -1.96483616 5.38010859
H  0.63598028 -1.78643957 2.94488594
O  0.08272478 0.21939849 -1.39977244
H  1.03097423 0.39678654 -1.52616769
