program: Gaussian 09
title: /home/michael/molsimp_comfiles/Cr_31a_19_OOH/Cr_31a_19_OOH.com auto generated
version: ES64L-G09RevE.01
frameworkgroup: C1[X(C27H20CrN6O4)]
method: UTPSSh
basis: Gen
operation: Freq
keyword: #P
keyword: Geom=AllCheck
keyword: Guess=TCheck
keyword: SCRF=Check
keyword: GenChk
keyword: UTPSSh/ChkBas
keyword: Freq
title: /home/michael/molsimp_comfiles/Cr_31a_19_OOH/Cr_31a_19_OOH.com auto ge
converged: YES YES NO YES
polarizability: 7.29296631e+02 -5.73145547e+00 5.04469455e+02 -6.18268283e+01 -3.25297696e+01 5.91423667e+02
1716.lowfreq: -0.0006 0.0004 0.0007 7.9944 9.0328 14.5692 18.8836 22.9129 26.8780
frequency: 18.2617 22.7699 26.6177 34.4550 40.6821 42.3150 52.0351 60.0243 77.7928 91.8677 96.3130 105.4330 113.2872 122.7485 140.7824 149.0751 166.0274 171.5294 180.3870 182.1925 192.0465 206.7273 219.5581 227.4321 250.0256 258.7416 274.0601 277.1102 308.5213 326.6035 332.3535 373.3130 385.8975 389.2002 389.9442 392.6651 394.7064 430.3565 449.1502 461.1114 476.7504 477.5162 487.9697 491.2482 498.8151 502.8637 530.9320 531.5640 537.6680 544.2398 571.0650 572.4843 637.9410 639.3758 647.5256 663.4589 665.6191 668.7229 695.4631 724.2722 758.4269 766.0557 767.7292 771.3838 775.2814 781.4623 781.9586 795.1830 798.0024 801.2240 840.7885 844.0782 849.7210 864.5346 866.4946 884.7838 893.6218 897.8160 903.9620 917.8308 947.1363 974.3823 976.9828 989.0694 991.5414 995.5519 1002.2960 1003.2380 1023.7717 1025.2789 1027.3528 1033.5066 1033.9533 1034.0857 1034.1973 1051.2844 1074.6546 1093.3759 1097.9680 1101.0946 1109.8674 1143.7493 1155.4871 1156.7902 1170.5894 1172.3674 1179.5227 1183.0209 1184.2201 1185.2391 1203.1251 1244.4967 1246.5574 1282.9616 1285.3732 1301.2737 1311.6257 1314.2391 1316.4157 1319.7039 1327.9021 1333.9222 1336.1531 1359.1247 1383.5816 1438.7186 1439.1746 1442.7443 1452.2507 1452.8919 1484.9475 1486.8783 1488.5804 1494.7206 1529.8319 1539.5789 1540.9251 1584.3501 1585.3054 1611.3749 1619.6670 1622.8000 1623.7440 1625.5148 1641.6234 1652.6624 1661.8670 1661.9653 3209.6949 3211.5321 3216.0544 3218.4642 3224.2354 3227.4368 3228.5744 3230.1253 3230.3338 3231.0486 3232.1733 3233.9406 3234.6321 3243.8740 3245.1180 3249.1277 3250.3081 3252.0411 3254.4581 3707.4960
redmass: 6.4009 5.6162 5.3698 5.6018 5.9848 4.5417 6.5825 7.8961 6.5346 7.0910 6.2400 5.4508 6.0291 6.7004 7.5563 7.1344 6.3671 6.8777 4.2374 6.7019 4.3559 6.6365 7.3453 7.6698 6.9086 9.7193 7.4435 5.6009 3.3762 3.0623 2.2976 9.1153 3.7267 4.3491 4.2818 5.5321 5.9979 3.5837 4.1522 4.2658 3.1304 3.0864 3.7535 3.8727 8.2561 12.4558 7.0739 7.0740 7.9493 8.1711 4.4079 6.2080 7.3561 7.3388 7.0994 4.5601 6.9438 4.7263 7.9348 5.4053 1.9435 1.3130 1.3228 8.4409 1.7746 5.5739 5.5436 3.7058 3.6493 2.1606 5.8825 5.9862 2.5931 1.3235 1.3084 7.5854 1.5098 1.5082 15.4280 1.3408 1.4169 5.1648 5.1738 1.3261 1.3199 1.3904 1.3568 1.3506 1.3162 1.3174 1.3488 2.3400 1.6667 3.2521 2.3751 6.6999 3.3223 3.2080 3.2087 2.0968 1.6852 1.8408 1.4863 1.5004 1.2109 1.2149 1.2122 1.2184 1.3981 1.4161 2.2024 2.9431 2.9053 1.8120 1.7996 3.8857 2.7145 2.7525 1.1012 3.1500 2.2914 3.0127 2.9157 3.6332 5.0983 6.2313 6.0921 2.5879 2.0424 2.0255 2.3659 2.3757 2.7129 2.2061 3.2860 3.0902 3.0586 6.7860 6.7663 5.9067 6.7157 5.8559 5.8214 9.7852 6.3828 6.2042 5.6788 5.7403 1.0873 1.0872 1.0893 1.0895 1.0956 1.0956 1.0888 1.0917 1.0919 1.0897 1.0987 1.0987 1.0921 1.0938 1.0938 1.0978 1.0995 1.0967 1.0965 1.0687
irintensity: 1.7595 0.1259 0.0339 8.2619 13.1997 2.1358 1.3239 6.1304 1.3432 0.2825 3.7512 2.4967 4.2973 1.2059 1.3860 6.0045 4.0900 0.6076 16.2321 11.1486 7.3153 1.2588 13.0396 5.0141 4.0602 31.1302 31.9089 6.9570 98.5982 94.5177 198.7791 77.6579 4.9923 5.2973 4.4546 19.4829 44.3467 14.3917 8.3396 0.6933 11.8254 9.8638 12.5984 6.1737 40.6265 211.6126 4.9621 1.9833 20.4246 24.1894 1.6679 4.7107 7.8474 8.9404 23.5992 2.1747 26.6510 5.1834 68.8856 57.2320 3.8875 58.3065 60.7922 48.3602 102.8606 24.9670 19.6310 6.3316 7.6651 39.8349 9.0545 15.0820 8.8345 72.5212 87.2926 38.4852 13.5574 14.6029 21.4898 0.6314 0.0513 2.6768 1.8209 2.4204 3.0494 0.8417 0.7719 1.2826 0.0015 0.0026 0.1964 6.1575 7.8727 22.5495 4.8029 47.1044 8.5924 19.4398 24.0708 51.5884 15.9613 11.4927 9.0727 7.0608 13.3272 13.0912 33.3351 8.8051 5.7934 6.7595 93.2953 18.1333 20.0375 0.2804 0.7547 264.8527 23.3439 16.0171 57.0251 32.7707 35.4912 10.0221 11.8339 148.4201 133.6442 101.7211 46.3260 2.1281 7.5236 22.5609 17.3172 23.2395 139.7308 134.7416 19.1937 12.1953 12.8291 13.2124 8.8511 31.5777 346.8886 79.4912 63.2169 1070.6160 95.9182 12.4763 6.4072 7.6573 0.0918 0.2910 2.2962 3.8735 15.9718 15.5134 5.9261 0.7659 1.1432 4.4900 20.1100 17.5611 1.6587 1.2768 0.5651 0.7341 5.4330 0.7358 1.6903 111.7607
temp: 298.150 k
press: 1.00000 atm
elementType: 24 8 6 8 6 6 6 6 6 6 6 6 6 6 7 7 1 1 1 1 1 1 1 7 6 6 6 6 6 6 6 6 7 1 1 1 1 1 1 7 6 6 6 6 6 6 6 6 7 1 1 1 1 1 1 8 8 1
symmnumber: 1
zpe: 1131014.0 jmol-1
zpe.correction: 0.430780 hartree
zpe.thermalcorrener: 0.462691 hartree
zpe.thermalcorrenthalpy: 0.463635 hartree
zpe.thermalcorrgfe: 0.364409 hartree
zpe.sumelectzpe: -1756.249813 hartree
zpe.sumelectthermal: -1756.217903 hartree
zpe.sumelectthermalent: -1756.216959 hartree
zpe.sumelectthermalfe: -1756.316185 hartree
dipole: 6.4683 11.1183 -13.2187
dipole: 18.4443
quadrupole: -88.8441 -168.8309 -206.0537
quadrupole: -30.1803 0.9208 7.9002
quadrupole: 65.7321 -14.2547 -51.4774 -30.1803 0.9208 7.9002
hfenergy: -1756.6805935 hartree
pointgroup: C01 [X(C27H20Cr1N6O4)]
dipole: -0.8443952 5.7486073 4.3471573 debye
polarizability: 666.779732|68.1379389|633.6846184|60.5533335|62.7097307|524.7254021 unknown
InChI: InChI=1S/C11H7N2O2.2C8H6N2.Cr.H2O2/c14-11(15)10-6-3-5-9(13-10)8-4-1-2-7-12-8;2*1-2-4-8-7(3-1)5-6-9-10-8;;1-2/h1-7H;2*1-6H;;1-2H/q-3;2*-1;+6;/p-1
charge 1 multiplicity 4
58 atoms
Cr -0.19776321 0.02250953 0.10440961
O  1.56520578 -3.59516539 0.64660153
C  1.26048687 -2.39997901 0.49987787
O  0.0421054 -1.96032241 0.34180081
C  2.30831909 -1.3175609 0.50004341
C  3.6775859 -1.48601783 0.6783116
C  4.48351779 -0.34153673 0.66652469
C  3.91915282 0.92249457 0.4792616
C  2.53459922 1.02091975 0.29884954
C  1.74721413 2.24479449 0.06522852
C  2.29868161 3.52073238 -0.04002222
C  1.45615889 4.60475917 -0.29186955
C  0.08817184 4.38284836 -0.44198945
C  -0.39833541 3.08131251 -0.32465245
N  0.40513327 2.03675585 -0.06492974
N  1.78393185 -0.09582723 0.31461241
H  4.09272485 -2.47598434 0.8241443
H  5.55510116 -0.43349094 0.80486613
H  4.54335711 1.80760191 0.47275201
H  3.36737954 3.66285371 0.06699867
H  1.86745247 5.60471267 -0.37623835
H  -0.59958796 5.19410357 -0.64889424
H  -1.45303088 2.86384831 -0.44381068
N  -2.31989391 -0.02345501 0.06542384
C  -3.07227621 0.84979928 0.79277361
C  -4.4496116 0.79778908 0.78979636
C  -5.07818287 -0.19404013 0.01469572
C  -6.48392175 -0.36714359 -0.0805209
C  -6.99255265 -1.37573685 -0.86916365
C  -6.13080204 -2.24870447 -1.59169098
C  -4.7638911 -2.10898514 -1.52186279
C  -4.21195479 -1.07581376 -0.71500198
N  -2.85642336 -0.96733211 -0.66946063
H  -2.51640156 1.58296047 1.36444071
H  -5.02791243 1.50547635 1.37390675
H  -7.13599757 0.3011958 0.47239434
H  -8.0663385 -1.51265706 -0.94579959
H  -6.56469117 -3.03216601 -2.20411703
H  -4.091965 -2.76398813 -2.06598722
N  -0.28618247 0.14008992 2.25582754
C  -1.00056889 -0.79309544 2.9464446
C  -1.02441596 -0.81878704 4.3245937
C  -0.28114992 0.15012367 5.02326481
C  -0.20317881 0.23700306 6.43801656
C  0.56237222 1.22498345 7.01754546
C  1.27597158 2.16372662 6.21983949
C  1.22051318 2.1089307 4.84619448
C  0.43957849 1.09682064 4.2218374
N  0.41660492 1.06715112 2.861196
H  -1.53625089 -1.5129338 2.34074771
H  -1.59999867 -1.57277057 4.85060699
H  -0.74868506 -0.48137313 7.04140291
H  0.62767924 1.29433214 8.09854072
H  1.8698781 2.92927043 6.70823844
H  1.75816699 2.81493214 4.22213938
O  -0.28681184 -0.10857554 -1.78863336
O  0.97092509 0.21131368 -2.45819814
H  1.40273606 -0.66246377 -2.49792224
