program: Gaussian 16
title: Step 5 - TS wB97XD/mod-cc-pVDZ - singlet
version: ES64L-G16RevC.01
method: RwB97XD
basis: Gen
operation: Freq
keyword: #P
keyword: #
keyword: WB97XD/CHKBASIS
keyword: GEOM=CHECK
keyword: GUESS=READ
keyword: NOSYMM
keyword: CONSTANTS=2006
keyword: CPHF=(GRID=FINEGRID)
keyword: SCF=(VSHIFT=300,NOSYM,MAXCYCLE=250)
keyword: INT=(ULTRAFINE,ACC2E=10)
keyword: FREQ
title: #P # WB97XD/CHKBASIS # GEOM=CHECK # GUESS=READ # NOSYMM # CONSTANTS=20
converged: YES YES YES YES
polarizability: 6.04234857e+02 2.16106900e+01 6.21027994e+02 -1.93057687e+01 -2.06198332e+00 6.63955856e+02
1716.lowfreq: -14.6903 -0.9818 -0.0026 -0.0020 -0.0012 2.9743 3.7204 9.5798 15.9994
redmass: 6.3332 5.5924 4.6769 4.5405 4.5937 5.7264 1.1828 3.0742 4.2604 1.2409 3.6397 4.4222 4.8890 5.1512 5.0759 4.9063 5.2946 5.2332 4.5075 4.5993 7.3327 6.0239 4.2902 2.7080 8.0563 2.1623 3.8787 3.5969 4.1982 5.1222 4.4429 3.6724 7.9670 7.7444 5.9553 1.9304 2.7273 5.6757 3.0551 3.4065 3.8381 2.8069 2.6254 2.9340 1.4660 2.4390 3.2226 5.3169 1.3363 1.4080 2.5132 3.1304 4.4876 2.6322 2.2154 2.0592 3.0307 1.9146 2.5730 1.8180 3.3543 2.3010 6.1798 1.6988 2.6171 3.3786 1.8774 2.8497 13.8138 2.5971 1.4023 1.9495 2.4070 2.3891 1.9574 2.6835 2.2935 2.3865 2.2729 3.2189 2.9412 2.9620 3.0572 2.8504 3.7372 2.7562 2.7704 3.6919 3.1393 4.2348 3.0357 1.8199 2.9481 3.2604 1.8065 3.4029 2.9396 3.9771 3.9525 3.0974 2.9818 3.6348 3.6067 4.4806 4.4079 4.6996 5.3475 5.2226 4.6675 5.2734 2.9887 4.3876 4.1925 3.9688 1.6887 1.7226 1.3891 3.8952 3.2290 3.3156 2.5476 2.3307 3.4284 3.2790 1.2290 1.2304 1.2623 1.2613 1.3145 2.0954 1.7063 2.6247 2.8220 2.6026 1.3771 1.3035 1.9604 1.8162 1.6608 1.8581 1.3628 1.3720 1.5839 1.9932 1.5316 2.1348 2.3368 2.4728 1.2814 1.4927 1.4289 1.3838 1.4370 2.5833 2.9577 2.1620 1.5005 2.3391 1.3924 1.6795 1.6314 1.8559 1.6164 2.0267 1.5655 1.8765 1.7120 1.6304 1.5612 1.5853 1.5936 1.5833 1.5512 2.3917 2.5319 1.3091 1.7252 1.7415 1.5650 1.7909 1.8425 1.9649 2.0467 2.8229 1.1119 2.2032 1.0974 2.1279 1.8940 1.5304 1.3008 1.8574 2.0828 1.7130 3.0588 2.5407 2.7693 2.5061 1.4462 1.8078 2.0621 3.4067 2.0655 2.0756 5.0091 1.6674 4.3245 2.4821 3.5579 3.1621 2.9404 1.8541 2.1050 1.9574 1.1923 1.3500 1.3416 1.1916 1.2762 1.2480 1.2086 1.2143 1.2511 1.3121 1.2200 1.3579 1.4295 1.3572 1.2993 1.3450 1.2639 1.2561 1.0761 1.0591 1.0611 1.0947 1.1026 1.0585 1.0712 1.0492 1.0651 1.0837 1.0788 1.0734 1.0606 1.1622 1.1563 1.1133 1.0741 1.1086 1.4287 1.6668 1.5415 1.1451 1.7630 1.8188 1.2384 1.1647 3.4174 3.5125 2.4173 3.7989 3.4414 2.5667 6.2649 6.0312 7.6285 7.6828 6.3161 6.0572 6.6336 6.5860 1.0510 1.0383 1.0379 1.0460 1.0471 1.0450 1.0468 1.0421 1.0391 1.0491 1.0439 1.0379 1.0499 1.0516 1.0441 1.0530 1.1008 1.1007 1.1003 1.1147 1.0970 1.1007 1.1017 1.0958 1.0980 1.1002 1.1009 1.1019 1.0992 1.1032 1.1026 1.1001 1.1000 1.1020 1.1139 1.0915 1.1039 1.1013 1.1038 1.1039 1.0914 1.0916 1.0970 1.0860 1.0914 1.0853 1.0974 1.0920 1.0899 1.0977 1.0931 1.0978 1.0972 1.0949 1.0951 1.1006 1.0931 1.0974
irintensity: 1.0564 0.3047 0.1107 0.1621 0.0470 0.4865 0.6899 0.5845 0.2834 0.8709 0.6249 0.0591 0.8512 0.8893 0.5149 0.7980 0.1829 0.3977 0.5682 0.7930 1.2361 0.5808 2.6025 0.6502 2.1045 0.4515 0.1714 1.3260 0.3037 4.6033 0.2335 0.1540 3.5689 3.1351 0.3320 4.0232 9.2584 1.7312 1.0167 0.9647 2.5290 0.3704 0.7489 0.6401 0.5399 1.6809 0.7421 8.3837 0.4672 1.5049 1.5286 2.7196 11.9401 1.5065 1.4326 0.0510 10.1482 6.0648 0.8427 1.0662 1.0136 1.0465 9.6881 2.6155 0.9977 9.0123 1.9761 0.3273 50.7489 1.6306 2.0423 1.1391 2.8767 0.9625 1.6748 8.3656 0.8379 1.2991 6.2559 0.5139 0.1339 0.4509 0.5756 4.7813 2.9421 1.0107 0.7739 0.1539 6.7052 4.2293 4.0162 0.7581 4.6923 0.9958 0.3592 2.9562 1.5398 9.1896 4.3886 8.0026 4.0035 13.4109 5.2889 2.0526 0.4463 1.7050 1.6706 0.7146 2.4757 3.2370 13.5600 9.0125 5.2722 11.5773 28.2772 26.8187 1.9557 5.6097 6.9404 12.4651 4.5259 3.1547 17.6748 19.0560 1.4483 0.9531 0.3742 0.3450 4.6341 18.0410 3.4493 3.6402 3.0591 3.2586 0.8697 0.0675 1.4613 0.5987 0.9582 1.2958 2.0615 3.1077 0.3225 0.7859 0.2378 2.8100 1.1128 4.2882 0.5266 2.5514 0.1758 1.4788 1.2456 4.0581 3.0335 2.5717 3.0495 12.9648 0.9668 15.5794 2.2181 4.3516 3.0115 37.9154 7.2312 1.4313 1.6082 3.9523 1.9297 6.3721 6.3004 3.9189 3.3834 4.8989 6.7951 1.5116 7.1656 2.1856 3.7038 1.3356 32.5397 15.8760 8.2695 6.5874 0.3002 1.7533 1.1632 3.6481 5.5081 17.9653 5.0260 51.0717 63.9715 1.6882 4.7045 9.7769 7.2906 4.9805 3.2336 35.2180 50.7053 54.7461 0.9587 2.6905 3.5832 1.3587 4.8534 1.1867 5.9156 9.0937 0.0733 5.2138 1.2415 0.1768 9.4997 6.4066 3.9968 12.7127 0.7317 5.1904 14.8047 6.8553 7.9617 2.4127 6.7600 10.7907 16.2604 14.4666 4.6032 4.8397 4.9711 1.7152 1.4148 2.8529 0.8009 0.5403 0.5930 4.1564 17.9473 7.0595 7.9189 6.1701 8.5217 16.7679 1.8295 15.2484 2.2335 4.3620 7.2849 3.3163 37.6268 2.4109 43.7845 50.6122 12.5075 18.2168 19.9527 10.1399 469.2463 33.1077 20.7044 266.4289 30.8259 22.0595 0.3448 0.2816 4.9261 7.5742 2.8125 4.0720 20.7251 23.8991 22.3038 34.9553 28.0023 26.7848 15.4837 17.7771 1.8453 21.3432 11.9681 5.5804 6.3267 5.7174 31.2635 27.2038 42.2818 28.9375 9.3018 12.4924 11.2489 5.3999 7.3158 6.6950 5.1430 9.1798 11.2662 10.3783 22.4347 2.2902 9.9527 10.4090 10.0482 22.3925 23.0241 8.5221 4.8711 10.6414 6.9765 7.5348 8.5173 5.3734 10.1955 8.7391 8.2513 2.4733 11.2270 1.8234 0.4348 8.7860 10.3037 3.5678 38.2038 3.3221 3.3865 31.6523 12.0503 41.8430 5.1883 11.0343
temp: 298.150 k
press: 1.00000 atm
elementType: 44 17 17 6 1 6 6 6 1 1 6 6 6 1 6 6 1 6 6 1 1 1 6 1 1 1 6 1 1 1 1 7 6 44 17 17 6 1 6 6 6 1 6 6 6 1 6 6 1 6 6 1 1 1 6 1 1 1 6 1 1 1 1 7 6 6 1 1 1 6 1 1 1 6 1 1 1 6 1 1 1 1 6 1 1 1 6 6 6 6 6 6 1 1 1 1 1 6 6 6 6 6 6 1 1 1 1 1 6 1 1 1
symmnumber: 1
zpe: 2461481.4 jmol-1
zpe.correction: 0.937529 hartree
zpe.thermalcorrener: 0.995017 hartree
zpe.thermalcorrenthalpy: 0.995961 hartree
zpe.thermalcorrgfe: 0.846713 hartree
zpe.sumelectzpe: -3926.172224 hartree
zpe.sumelectthermal: -3926.114735 hartree
zpe.sumelectthermalent: -3926.113791 hartree
zpe.sumelectthermalfe: -3926.263040 hartree
hfenergy: -3927.1097525 hartree
pointgroup: C01 [X(C46H58Cl4N2Ru2)]
dipole: 0.6889054 0.2421575 0.7421341 debye
polarizability: 604.2348565|21.61069|621.0279937|-19.3057687|-2.0619833|663.9558557 unknown
InChI: InChI=1S/2C22H27N.2CH2.2ClH.2Cl.2Ru/c2*1-16-12-17(2)20(18(3)13-16)23-15-22(6,14-21(23,4)5)19-10-8-7-9-11-19;;;;;;;;/h2*7-13H,14H2,1-6H3;2*1H2;2*1H;;;;/q;;;;;;;;2*+1/p-2
charge 0 multiplicity 1
112 atoms
Ru -0.90085022 0.58700152 -1.95136697
Cl -2.62564488 0.79302666 -3.5371503
Cl 0.84371679 1.02618173 -0.32295483
C  -1.36358103 -1.17189185 -1.52150216
H  -2.40377819 -1.47785569 -1.71611915
C  0.36391689 0.01438591 -3.41632194
C  1.85954808 0.42851602 -5.25392315
C  1.03053243 -0.81798396 -5.55295992
H  0.16874595 -0.53968754 -6.1792571
H  1.60891221 -1.57806748 -6.0925221
C  1.34652754 2.24116373 -3.49162737
C  2.41420339 2.50749682 -2.60940437
C  2.54200977 3.79981916 -2.10614651
H  3.35444985 4.00283562 -1.40352109
C  1.65052909 4.82215524 -2.43220929
C  0.62042082 4.52927238 -3.31857781
H  -0.0864503 5.31363685 -3.60112567
C  0.45263757 3.25687455 -3.87637957
C  3.4121021 1.47515904 -2.14860349
H  3.06096131 0.44946161 -2.29395033
H  3.60776213 1.60448107 -1.076035
H  4.36873816 1.5925698 -2.68105253
C  1.78959041 6.18747599 -1.81260615
H  1.45725839 6.16774676 -0.76242833
H  1.18317414 6.93536765 -2.3420316
H  2.83686062 6.52434665 -1.81953455
C  -0.64761709 3.08661564 -4.89230564
H  -1.5887153 3.50138674 -4.50639596
H  -0.84690136 2.04177891 -5.14589279
H  -0.38706094 3.63510738 -5.81157272
H  -0.64699521 -2.00008384 -1.42561035
N  1.16084964 0.89674436 -3.99979112
C  0.49902427 -1.31324034 -4.19108793
Ru -1.11707325 -0.23299764 0.66883252
Cl -2.4322073 1.60011257 -0.23783719
Cl 0.24015857 -2.19699601 1.04356322
C  -2.59454588 -1.32417969 0.67322586
H  -3.5941991 -0.97850556 0.35465895
C  -1.07087275 0.27551586 2.61578294
C  -1.48761161 0.34422328 4.98500659
C  -1.02520503 1.72709954 4.54383493
H  -1.90437476 2.37881714 4.42175028
C  -2.62520278 -1.38943415 3.51038627
C  -3.95456377 -1.07221078 3.16019542
C  -4.87838252 -2.11199239 3.06981968
H  -5.90782017 -1.87283386 2.7886363
C  -4.52342889 -3.4409333 3.30823006
C  -3.19855499 -3.71498675 3.63631643
H  -2.89210327 -4.75081101 3.80421768
C  -2.22809416 -2.71294361 3.74337775
C  -4.42035924 0.32916403 2.84634529
H  -3.60407274 1.05890293 2.82608175
H  -4.89605162 0.35894513 1.85541882
H  -5.17029402 0.66128189 3.58083419
C  -5.55059224 -4.53779995 3.20203358
H  -5.09284712 -5.53055905 3.31063166
H  -6.31970401 -4.43209298 3.98333397
H  -6.06545775 -4.50400343 2.22987656
C  -0.81769203 -3.12218719 4.07570936
H  -0.74506995 -3.44485998 5.12677757
H  -0.52154656 -3.96735328 3.44011881
H  -0.09496806 -2.32209782 3.89482013
H  -2.52611228 -2.41116877 0.85388385
N  -1.68944609 -0.3033899 3.63524725
C  -0.34747975 1.54122251 3.16536923
C  1.76803839 1.47001396 -6.36625135
H  2.28555617 1.07753973 -7.2541355
H  2.25747028 2.41208028 -6.07761579
H  0.72954743 1.68172135 -6.64645448
C  3.33516067 0.10421152 -5.00156262
H  3.90258689 1.01456792 -4.76645853
H  3.75774514 -0.3237957 -5.92265781
H  3.47221606 -0.62567587 -4.19460446
C  -0.41933136 -0.39400143 5.79788536
H  0.52162706 -0.49882338 5.24262034
H  -0.76927661 -1.38916411 6.10154675
H  -0.21351869 0.18262181 6.71209379
C  -2.78208737 0.39835786 5.79280048
H  -3.14229984 -0.60717666 6.05302819
H  -3.57875465 0.93135715 5.25870538
H  -2.5817006 0.94156083 6.72843862
H  -0.35827331 2.19454276 5.27922233
C  -0.63538695 2.78714648 2.30933092
H  -0.30462565 3.6816925 2.85793853
H  -1.71246533 2.88722826 2.11704761
H  -0.11874851 2.75256947 1.34408564
C  1.16814507 1.34975737 3.31947646
C  3.95332863 1.09910979 3.67524796
C  1.92612104 2.39862903 3.86007459
C  1.83181505 0.17460332 2.96346213
C  3.2109354 0.05205921 3.13896273
C  3.30087403 2.27760646 4.03722915
H  1.44003641 3.33185586 4.1534285
H  1.28832694 -0.66111511 2.52157072
H  3.70010524 -0.87826841 2.84412632
H  3.86547009 3.11066805 4.46088081
H  5.03203455 1.00173177 3.81163281
C  1.5027268 -2.23699703 -3.48237603
C  3.30768542 -4.01006976 -2.24460118
C  1.92245855 -2.02983201 -2.16582222
C  1.99213259 -3.36067269 -4.16394084
C  2.88744522 -4.23487354 -3.55627776
C  2.81483872 -2.90978711 -1.55205618
H  1.55014748 -1.1870743 -1.58318028
H  1.66891033 -3.56453862 -5.18736426
H  3.25519986 -5.10119916 -4.10982543
H  3.10019925 -2.7265442 -0.5153482
H  4.00584842 -4.6982863 -1.76482216
C  -0.82271982 -2.06552457 -4.40522595
H  -1.61720815 -1.38142566 -4.73196486
H  -1.15587635 -2.57778149 -3.49500547
H  -0.67086187 -2.83605056 -5.17659663
