program: Gaussian 09
title: 000032181
version: EM64L-G09RevD.01
frameworkgroup: C1[X(C18H15N3O2S)]
method: RPBEPBE
basis: SDD
operation: Freq
keyword: #p
keyword: freq=noraman
keyword: PBEPBE/SDD
title: #p freq=noraman PBEPBE/SDD
converged: NO YES NO NO
title: Mulliken charges:
elementType: S O O N N N C C C C C C C C C C C C C C C C C C H H H H H H H H H H H H H H H
charge: 0.473173 -0.238511 -0.242134 -0.414494 -0.508020 -0.401556 0.050800 -0.281377 0.226544 0.142371 0.483427 -0.749153 0.252369 0.170646 -0.345524 -0.450448 -0.323738 -0.335710 -0.213316 -0.201681 -0.226621 -0.246546 -0.252453 -0.223158 0.356060 0.325895 0.265003 0.247573 0.226937 0.308801 0.224984 0.279409 0.207724 0.231516 0.230691 0.239287 0.238940 0.233254 0.239039
chargesum: 0.00000
title: Mulliken charges with hydrogens summed into heavy atoms:
elementType: S O O N N N C C C C C C C C C C C C C C C C C C
charge: 0.473173 -0.238511 -0.242134 -0.058434 -0.182125 -0.401556 0.050800 -0.281377 0.226544 0.142371 0.483427 -0.009640 0.252369 0.170646 -0.036723 -0.225464 -0.044329 -0.127986 0.018199 0.029010 0.012666 -0.007607 -0.019199 0.015882
polarizability: 3.11084441e+02 1.77951630e+01 3.31316437e+02 2.28281300e+01 -6.94422821e+00 1.27957893e+02
1716.lowfreq: -3.2422 -1.1077 -0.0017 -0.0010 -0.0007 4.9952 22.0001 23.8358 34.5422
frequency: 21.9524 23.6750 34.5267 40.8026 55.2921 77.9594 82.3750 93.5265 123.1707 137.7972 157.5330 168.9356 183.6297 214.8185 245.5759 250.4764 281.3076 304.3697 328.6091 332.6214 391.9061 396.6551 407.3014 435.7955 439.4201 463.2297 503.8034 512.6344 524.4887 565.8859 576.6232 611.3548 613.7615 614.7319 636.5853 667.2675 683.6406 686.3720 695.6527 696.7559 733.4342 753.4623 762.3089 774.1967 794.0352 809.6501 843.5387 848.8013 854.3334 919.1544 927.4143 937.5437 975.0553 983.9707 988.3282 989.1581 1001.0003 1004.5675 1012.0825 1017.4539 1025.2524 1038.3333 1042.9301 1080.2217 1090.5618 1098.3922 1164.6213 1173.7435 1176.5421 1188.7240 1198.9195 1248.9117 1250.9503 1296.4986 1316.7761 1326.8153 1373.6254 1384.0204 1386.5119 1394.5143 1407.0464 1420.6513 1428.6422 1442.7577 1456.9900 1475.5557 1483.0779 1487.8220 1495.5069 1539.1184 1568.1363 1595.2715 1604.9941 1607.6406 1610.8975 1613.7610 2995.7154 3082.7353 3105.0209 3112.0362 3123.0471 3134.9834 3137.5320 3146.5629 3150.3710 3162.4769 3167.2258 3173.7813 3197.3481 3492.3967 3496.8172
redmass: 6.0251 3.7064 5.2148 4.3554 6.9688 6.4946 6.4559 4.6402 1.3978 2.8099 5.3588 5.6860 6.1147 5.8444 4.1859 4.8972 5.3652 7.4572 7.3472 8.0827 5.5549 2.7589 2.9423 7.3274 5.3401 5.5246 5.3926 3.3321 3.8857 2.6810 2.4031 5.7806 6.4374 6.1005 8.0229 6.7334 5.0518 6.6819 1.7958 1.6130 5.8763 4.4370 1.6622 1.4555 2.4402 5.9808 1.3008 3.5805 1.4198 1.4284 7.0451 1.4246 1.3549 6.0226 5.8308 1.3960 1.3165 1.9871 1.3498 2.9898 2.3340 2.3921 1.5135 2.2333 1.5827 2.1347 4.7140 1.0523 1.0603 1.1162 1.1290 2.9203 2.6858 2.5649 1.5064 1.6121 3.6475 6.5775 7.7765 1.4086 2.9144 2.3762 2.3793 2.1906 1.0539 1.4358 2.2780 2.2411 2.1122 5.4051 5.3480 7.9913 5.8682 4.2840 5.8663 6.0067 1.0376 1.0958 1.0891 1.0889 1.1006 1.0868 1.0867 1.0932 1.0914 1.0957 1.0997 1.1011 1.0952 1.0764 1.0763
irintensity: 0.0611 0.0699 0.6121 2.0216 0.8393 0.4003 9.7539 1.9400 1.8197 2.7111 5.0200 1.2164 2.4908 6.2250 6.9358 5.2375 3.6568 5.0242 4.6580 2.0239 0.8591 0.6424 0.0293 2.7269 2.1622 0.6249 17.6200 32.2117 19.2766 19.1700 49.9712 3.5389 0.9349 5.2623 1.6532 16.9020 2.6844 5.2288 12.4080 123.3678 12.6002 7.1994 65.6367 73.7910 16.1026 8.9526 2.2793 7.6454 4.8766 15.1692 18.2013 1.8625 0.3345 0.3538 2.3078 0.6403 2.0622 3.5462 0.9684 13.3954 3.1210 35.0695 6.0578 19.5663 26.7150 17.1021 65.0697 0.3811 2.9897 2.8692 13.2352 45.8405 136.6149 84.0273 53.5593 63.3426 63.5041 197.7080 5.1998 60.1768 48.7174 127.5720 25.5779 76.5922 21.2009 69.4444 50.6939 21.2754 279.2706 360.6642 76.8582 99.3588 46.8401 102.0745 8.9428 46.7993 13.7335 10.7471 16.6914 15.4554 8.8431 0.2357 0.8717 25.4921 14.3256 8.7662 23.1763 21.9972 6.1715 38.7793 11.3414
temp: 298.150 k
press: 1.00000 atm
elementType: 16 8 8 7 7 7 6 6 6 6 6 6 6 6 6 6 6 6 6 6 6 6 6 6 1 1 1 1 1 1 1 1 1 1 1 1 1 1 1
symmnumber: 1
zpe: 767913.4 jmol-1
zpe.correction: 0.292483 hartree
zpe.thermalcorrener: 0.313788 hartree
zpe.thermalcorrenthalpy: 0.314732 hartree
zpe.thermalcorrgfe: 0.239574 hartree
zpe.sumelectzpe: -1406.024921 hartree
zpe.sumelectthermal: -1406.003615 hartree
zpe.sumelectthermalent: -1406.002671 hartree
zpe.sumelectthermalfe: -1406.077830 hartree
dipole: 2.7346 6.9737 1.0859
dipole: 7.5690
quadrupole: -136.6684 -152.6993 -148.9525
quadrupole: 5.9025 -4.3478 1.8597
quadrupole: 9.4383 -6.5925 -2.8458 5.9025 -4.3478 1.8597
hfenergy: -1406.3174035 hartree
pointgroup: C01 [X(C18H15N3O2S1)]
dipole: 0.5713934 -2.9011993 -0.3526662 debye
polarizability: 306.1486997|-13.4861803|336.7206129|-20.5738791|-7.6706607|127.4894588 unknown
InChI: InChI=1S/C18H15N3O2S/c1-12-15(17(23)19-14-10-6-3-7-11-14)18(24-21-12)20-16(22)13-8-4-2-5-9-13/h2-11,19-20H,1H3
charge 0 multiplicity 1
39 atoms
S  0.858818 3.789938 -0.42066
O  -3.015956 1.045009 1.152498
O  3.000168 2.060138 -0.394251
N  0.983014 1.008966 0.038728
N  -1.737483 -0.139745 -0.436609
N  -0.812253 4.523344 -0.361436
C  -1.210906 2.191167 -0.004538
C  0.186941 2.144785 -0.122869
C  -1.714852 3.552668 -0.121382
C  -2.077586 1.013762 0.301758
C  -2.261432 -1.463618 -0.323146
C  -3.170172 3.936533 -0.021228
C  3.066948 -0.319521 0.128483
C  2.379658 0.992687 -0.097048
C  -3.213752 -1.841675 0.660827
C  -1.770518 -2.433375 -1.240796
C  4.486142 -0.298451 0.164794
C  2.387069 -1.557559 0.293872
C  -3.652446 -3.182712 0.714046
C  -2.224278 -3.766071 -1.176676
C  5.213448 -1.486826 0.373092
C  3.117935 -2.746504 0.501352
C  -3.167525 -4.150739 -0.195005
C  4.531452 -2.714674 0.54443
H  0.499858 0.160097 0.347235
H  -1.150116 0.028344 -1.259879
H  -3.584387 3.618443 0.950482
H  -3.272401 5.026948 -0.13365
H  -3.766081 3.437339 -0.807432
H  -3.601867 -1.090138 1.35007
H  -1.042062 -2.142072 -2.009784
H  4.991193 0.662878 0.026163
H  1.292742 -1.631539 0.25155
H  -4.388285 -3.468433 1.47389
H  -1.8430 -4.501178 -1.893839
H  6.307654 -1.457728 0.402941
H  2.585362 -3.695008 0.626868
H  -3.521736 -5.185564 -0.144508
H  5.094993 -3.639714 0.707357
