program: Gaussian 09
title: Step 5 - protocol 1
version: EM64L-G09RevD.01
method: RwB97XD
basis: Gen
operation: Freq
keyword: #P
keyword: #
keyword: WB97XD/CHKBASIS
keyword: GEOM=CHECK
keyword: GUESS=READ
keyword: NOSYMM
keyword: INT=ULTRAFINE#
keyword: SCF=(VSHIFT=300,NOSYM,MAXCYCLE=250)
keyword: CPHF=(GRID=FINEGRID)
keyword: FREQ
title: #P # WB97XD/CHKBASIS # GEOM=CHECK # GUESS=READ # NOSYMM # INT=ULTRAFIN
converged: YES YES NO YES
title: Mulliken charges:
elementType: C C C C C C N C N C C Ru C C C C C C C C C C C C C Cl Ru Cl C H Cl C N C C N C C C C C C C C C C C C C C C C C C Cl H H H H H H H H H H H H H H H H H H H H H H H H H H H H H H H H H H H H H H H H H H H H H H H H H H H H H H H
charge: -0.040008 0.018969 -0.106943 0.007071 -0.091349 -0.019599 -0.295738 0.163184 -0.289168 0.067484 0.067768 -0.031895 0.106758 0.005323 -0.090407 -0.028967 -0.086937 -0.018836 -0.075588 0.014869 0.006964 0.015036 0.017403 -0.001818 0.016554 -0.305820 -0.031825 -0.305885 0.106620 0.083354 -0.353465 0.163200 -0.295601 0.067612 0.067439 -0.289053 0.018878 -0.039448 -0.019706 -0.091383 0.007368 -0.106962 0.005343 -0.075509 -0.018174 -0.086988 -0.029677 -0.090547 0.016313 -0.001451 0.017274 0.015183 0.007232 0.014789 -0.353503 0.083421 0.052746 0.057671 0.059471 0.056986 -0.028675 -0.026826 -0.064358 -0.031884 0.130933 0.038996 0.036870 0.042051 0.064427 0.054478 0.042155 0.034864 0.108796 0.045336 0.115055 0.048473 0.075524 0.050511 0.041708 0.034581 0.090907 0.026665 0.088262 0.088262 0.057654 0.052755 0.057028 0.059477 -0.026605 -0.028840 -0.031925 -0.064270 0.108857 0.034861 0.042043 0.040926 0.055745 0.063983 0.036899 0.039009 0.130971 0.090603 0.034660 0.026887 0.075495 0.041065 0.050679 0.114872 0.045498 0.048530
chargesum: 0.00000
title: Mulliken charges with hydrogens summed into heavy atoms:
elementType: C C C C C C N C N C C Ru C C C C C C C C C C C C C Cl Ru Cl C Cl C N C C N C C C C C C C C C C C C C C C C C C Cl
charge: -0.040008 0.018969 -0.106943 -0.057287 -0.091349 -0.051483 -0.295738 0.163184 -0.289168 0.177900 0.184224 -0.031895 0.278441 0.005323 -0.090407 -0.057642 -0.086937 -0.045662 -0.075588 0.221668 0.167921 0.200850 0.226267 0.165926 0.168707 -0.305820 -0.031825 -0.305885 0.278236 -0.353465 0.163200 -0.295601 0.184118 0.177847 -0.289053 0.018878 -0.039448 -0.051631 -0.091383 -0.056903 -0.106962 0.005343 -0.075509 -0.044780 -0.086988 -0.058516 -0.090547 0.168463 0.165788 0.226173 0.200944 0.167887 0.221668 -0.353503
chargesum: -0.00004
polarizability: 4.90955481e+02 -3.04558340e+00 7.20290844e+02 2.84135757e+01 -1.42273498e+01 6.39013225e+02
1716.lowfreq: -3.9164 -0.9304 -0.0022 -0.0004 0.0045 2.9215 12.2049 13.3868 16.8952
redmass: 1.1282 3.4987 4.3833 5.1299 4.1986 5.9837 4.1173 4.2305 1.0941 5.4345 5.7152 7.0766 3.8486 4.0241 6.0514 4.1951 3.6890 4.9297 3.7915 4.5542 3.7763 4.0750 1.1957 1.6343 3.3028 1.7589 1.8568 1.2069 2.6810 1.8937 2.8366 2.1089 3.1803 4.8179 2.4981 2.3248 3.2492 2.6413 2.0836 1.8006 1.8161 4.4368 2.7255 1.5332 2.1716 2.3806 4.2534 1.7324 2.2552 3.0465 2.4052 3.8004 2.6186 1.5224 1.5819 1.3078 2.0679 2.5007 2.5144 2.8446 3.1852 2.9748 4.5424 4.3354 2.5376 2.5692 2.8340 2.9493 8.2665 4.2429 3.4083 3.3415 8.4024 4.4326 3.0706 5.7368 5.4046 9.3585 4.5169 4.6562 4.8982 5.0624 4.7276 4.7016 4.4656 4.4643 4.2569 4.2633 3.4862 3.4912 3.6564 3.6697 2.9771 3.0065 3.0481 3.0465 4.2811 4.2887 4.1408 4.1021 4.1166 4.2195 4.1406 4.1180 3.4463 3.4870 3.5010 3.7232 3.7786 3.6485 3.9629 3.9470 7.1878 7.2578 4.1269 4.1941 3.6870 3.6856 2.1112 2.1272 1.2349 1.2182 3.6546 3.6478 1.2694 1.2704 1.2684 1.2650 1.8402 1.8279 1.3004 1.3003 1.2982 1.2463 1.3350 1.3597 3.5260 3.6944 2.1164 2.1093 2.1501 2.1715 2.9551 2.9450 3.5648 3.5951 2.9333 2.9512 1.5384 1.5310 1.5396 1.5577 1.9616 1.6806 1.6727 1.8928 1.6434 1.7519 1.7076 1.8208 1.6021 1.5808 1.6316 1.5706 1.5685 1.6034 1.5929 1.5974 1.5917 1.5733 2.0054 1.9748 3.0929 3.0932 3.9975 4.0337 1.6840 1.6783 1.5759 1.5818 1.3964 1.4011 1.1761 1.1745 1.1919 1.1820 1.3422 1.3484 1.3481 1.9558 3.1240 2.1045 1.8499 1.8445 3.1195 3.1879 2.5081 2.3737 4.7663 4.9483 4.5868 4.6037 3.0300 3.0780 2.6992 2.7199 1.2482 1.2505 1.2627 1.2854 1.2847 1.2818 1.2538 1.2438 1.2421 1.2354 1.6528 1.6049 1.5635 1.5567 1.3916 1.4079 1.4117 1.4196 1.4949 1.6180 1.3409 1.2896 1.0514 1.0638 1.1114 1.0856 1.0582 1.0577 1.0570 1.0694 1.0828 1.1639 1.0807 1.1010 1.2568 1.1622 1.1311 1.1083 1.2640 1.3104 1.3807 1.4009 2.1931 2.2128 2.1559 2.1388 1.7392 1.1621 1.4251 1.3060 3.8506 3.8509 4.4222 4.3896 8.0174 8.0016 8.2341 8.1833 6.8430 6.8338 6.8354 6.7879 1.0675 1.0681 1.0577 1.0570 1.0397 1.0393 1.0398 1.0395 1.0386 1.0386 1.0662 1.0429 1.0603 1.0412 1.0389 1.0403 1.0422 1.0422 1.0989 1.0987 1.0985 1.0987 1.0995 1.0997 1.1025 1.1013 1.1033 1.1001 1.1002 1.1009 1.0993 1.0998 1.0984 1.0978 1.1032 1.1025 1.1030 1.1031 1.1030 1.1026 1.1034 1.1034 1.1029 1.1023 1.0915 1.0915 1.0969 1.0929 1.0916 1.0916 1.0915 1.0979 1.1061 1.1061 1.0904 1.0898
irintensity: 0.2000 0.0529 0.0030 0.3564 0.6533 0.7927 0.8408 0.0179 0.0581 0.0536 1.4053 2.0649 0.6082 0.5225 0.1793 1.1258 0.0420 0.2335 1.1347 0.2910 0.0765 0.2703 0.0774 0.7702 1.0716 0.3100 0.2180 0.1401 1.4700 0.1930 3.2346 0.3072 0.1202 0.2697 0.3230 0.3952 4.9934 1.5481 2.8467 2.1696 0.3023 0.1049 0.3968 1.3509 0.3755 4.0253 3.4742 4.4259 1.1580 15.5537 16.9858 2.5804 9.7045 3.3340 6.2376 0.3695 0.1090 0.0613 0.0375 0.7067 0.5106 0.1171 2.9534 3.6413 0.2073 0.0095 0.1682 0.2711 1.2727 1.8610 4.7968 4.4019 8.4567 0.3124 1.0437 4.9409 12.2037 34.7332 3.8049 6.7115 8.4464 24.4930 1.5761 1.2443 10.2536 5.1783 0.2284 0.0473 0.5178 0.4061 0.6804 0.7180 0.1407 0.1711 0.1266 0.1198 0.4723 3.2097 1.2255 1.2507 5.6799 0.6066 0.6711 0.8555 13.0019 0.8277 8.3692 2.0759 3.4214 3.7759 0.9925 2.7127 7.0331 14.7883 0.8728 0.1225 0.4930 8.9385 9.2219 22.3205 25.3422 1.7882 2.6760 1.6787 18.9710 1.1876 6.2840 5.0233 16.1728 22.0567 0.1851 0.2511 3.6679 3.3734 21.7428 7.4648 4.1112 2.5209 2.4099 5.8722 2.3410 1.5023 0.9557 2.7733 0.7719 0.5499 3.5104 2.1694 7.1635 6.0950 0.2867 0.9654 10.2038 3.1750 5.9117 6.3202 1.3852 1.8282 0.2789 0.4210 0.6310 2.2662 19.7644 2.9756 3.7650 9.1958 6.3188 9.6751 13.2956 3.8816 0.3433 0.3814 0.4258 0.4568 9.5693 11.2137 1.8316 1.8183 1.1315 0.6833 3.0602 0.0067 4.6643 4.1758 3.3159 4.2686 0.8470 1.3303 0.0459 0.0753 0.8099 0.3806 92.0320 183.0226 8.9421 5.4663 224.1678 24.5599 15.0659 3.2748 56.7747 15.0208 12.9116 16.5457 28.1683 11.1442 2.1515 1.0976 1.9845 4.2120 1.0586 0.9036 3.7425 7.9738 3.6126 7.5258 2.9425 1.3661 0.5480 0.5677 6.6043 7.3301 11.7712 12.5260 25.2222 23.5723 53.4859 49.9054 15.8407 6.9606 7.4016 1.4018 0.9184 3.5758 20.0555 0.3980 13.2158 7.1774 4.0257 10.2503 10.9409 65.9756 1.1694 0.0548 38.5729 49.6851 14.7027 19.2165 11.5223 7.3036 24.5575 26.0658 87.7663 21.2202 68.1203 38.1455 82.3778 407.1901 55.0465 101.1777 2.2554 0.4516 13.5065 8.0101 16.9433 21.4503 8.6830 20.2674 78.7164 19.9183 13.2344 11.8039 35.3760 24.8800 9.7775 12.6297 34.3966 40.3389 26.2967 37.1342 26.0874 56.5871 11.0660 44.2339 18.7077 4.6816 13.8412 13.6314 14.3628 22.6617 9.8884 18.4561 9.3891 7.1508 14.2307 19.0292 1.9421 7.5030 9.6144 12.5522 14.8075 14.4577 27.8060 3.0198 7.8293 10.7467 17.2160 14.6497 8.8397 8.6423 6.3644 4.1777 14.7444 14.8716 14.7701 10.7448 15.2677 12.5263 14.0544 6.8830 2.2271 1.8879 10.9805 5.0970
temp: 298.150 k
press: 1.00000 atm
elementType: 6 6 6 6 6 6 7 6 7 6 6 44 6 6 6 6 6 6 6 6 6 6 6 6 6 17 44 17 6 1 17 6 7 6 6 7 6 6 6 6 6 6 6 6 6 6 6 6 6 6 6 6 6 6 17 1 1 1 1 1 1 1 1 1 1 1 1 1 1 1 1 1 1 1 1 1 1 1 1 1 1 1 1 1 1 1 1 1 1 1 1 1 1 1 1 1 1 1 1 1 1 1 1 1 1 1 1 1 1 1
symmnumber: 1
zpe: 2383031.8 jmol-1
zpe.correction: 0.907649 hartree
zpe.thermalcorrener: 0.970109 hartree
zpe.thermalcorrenthalpy: 0.971053 hartree
zpe.thermalcorrgfe: 0.806219 hartree
zpe.sumelectzpe: -3958.310549 hartree
zpe.sumelectthermal: -3958.248089 hartree
zpe.sumelectthermalent: -3958.247145 hartree
zpe.sumelectthermalfe: -3958.411979 hartree
dipole: 0.0470 -0.9888 0.1900
dipole: 1.0080
quadrupole: -377.7982 -338.0682 -329.2378
quadrupole: -7.1140 -31.1672 0.4705
quadrupole: -29.4301 10.2999 19.1303 -7.1140 -31.1672 0.4705
hfenergy: -3959.2181983 hartree
pointgroup: C01 [X(C44H56Cl4N4Ru2)]
dipole: 0.0184775 -0.3890351 0.0747479 debye
polarizability: 490.9554806|-3.0455834|720.2908444|28.4135757|-14.2273498|639.0132255 unknown
InChI: InChI=1S/2C21H26N2.2CH2.4ClH.2Ru/c2*1-14-9-16(3)20(17(4)10-14)22-7-8-23(13-22)21-18(5)11-15(2)12-19(21)6;;;;;;;;/h2*9-12H,7-8H2,1-6H3;2*1H2;4*1H;;/q;;;;;;;;2*+2/p-4
charge 0 multiplicity 1
110 atoms
C  -0.16405229 2.34232873 -4.37620744
C  0.81966409 1.9266358 -3.45600235
C  1.2553017 2.76537067 -2.42388937
C  0.62301317 4.00772998 -2.28168634
C  -0.3904013 4.42552504 -3.13694186
C  -0.76152749 3.58270879 -4.19045281
N  1.44525218 0.65993433 -3.69546447
C  1.0119704 -0.5602753 -3.28804764
N  1.76298157 -1.47815307 -3.94271264
C  2.67657802 -0.88382067 -4.92266001
C  2.62396243 0.59576051 -4.55953367
Ru -0.24973366 -0.72588442 -1.74254273
C  -0.56889234 -2.48984065 -1.75700478
C  1.5368164 -2.8854042 -4.01153675
C  0.50655049 -3.37049524 -4.83176431
C  0.32483449 -4.75138421 -4.90727196
C  1.13510802 -5.63993821 -4.19414373
C  2.14656996 -5.11785137 -3.3865758
C  2.36858654 -3.74241875 -3.28235856
C  -0.43346202 -2.42596936 -5.53192171
C  0.92542056 -7.12757209 -4.31259708
C  3.4344129 -3.19046642 -2.37516439
C  2.39752452 2.42820042 -1.50311584
C  -1.0803288 5.7504877 -2.94226914
C  -0.55578268 1.46882907 -5.53691738
Cl 1.63046567 -0.58953791 -0.27191238
Ru 0.27726408 -0.04708933 1.88755321
Cl -1.58951609 -0.56594858 0.48665763
C  0.7173052 -1.6671317 2.51666295
H  1.35523363 -2.29812348 1.87177663
Cl 2.10207245 1.23318345 2.60458812
C  -1.01067837 0.5637383 3.29328082
N  -1.53126531 1.81673501 3.25262038
C  -2.71216477 1.97930981 4.10076146
C  -2.66392038 0.72322167 4.96301071
N  -1.70333158 -0.11452063 4.23944535
C  -0.99118225 2.95796327 2.5750815
C  -0.0492451 3.73655684 3.27772978
C  0.46538287 4.86928288 2.65971205
C  0.05131622 5.25972936 1.3813377
C  -0.92100074 4.50014664 0.74058707
C  -1.46983538 3.34794148 1.31921435
C  -1.38298016 -1.38974278 4.79381691
C  -2.14731262 -2.5014281 4.42299574
C  -1.83439356 -3.73495606 5.00003474
C  -0.79876313 -3.87172342 5.92528717
C  -0.05788725 -2.73728001 6.27059403
C  -0.3313075 -1.48622691 5.71826644
C  0.38553109 3.3565633 4.66702451
C  0.65268926 6.4745062 0.72402657
C  -2.57552842 2.63191221 0.59056008
C  -3.23849545 -2.37502248 3.39488146
C  -0.48780719 -5.20557639 6.55394614
C  0.53465593 -0.29520599 6.03060573
Cl -2.1492072 0.09120666 -2.84117479
H  -1.168114 -2.89680592 -0.92254564
H  2.31461807 -1.08532753 -5.94548643
H  3.68181578 -1.31589883 -4.82616072
H  3.51532863 0.92484512 -4.00049402
H  2.50339996 1.25376816 -5.43112587
H  -0.48240462 -5.14427509 -5.53114988
H  2.77921863 -5.79902557 -2.81161129
H  0.95617661 4.6666279 -1.47726926
H  -1.5368182 3.90616473 -4.88963757
H  -1.08115728 -1.91337688 -4.8009099
H  -1.07538525 -2.9648796 -6.24124053
H  0.10364421 -1.64147555 -6.08570513
H  1.40761744 -7.6692505 -3.48692218
H  1.35104947 -7.50759172 -5.25543741
H  -0.14492221 -7.38100065 -4.31055584
H  4.17915327 -2.60261604 -2.93473154
H  3.96711535 -4.00003705 -1.85861383
H  2.99656216 -2.5207239 -1.61972418
H  2.84393606 1.453038 -1.72465097
H  2.06664873 2.39734974 -0.45356785
H  3.17756483 3.20162909 -1.58113832
H  -2.04175952 5.61615272 -2.41897445
H  -1.3002277 6.23403333 -3.90542241
H  -0.46720301 6.4399482 -2.34504043
H  -1.25802462 1.99417409 -6.19784987
H  -1.04622146 0.55466482 -5.17395008
H  0.31830702 1.17394935 -6.13964238
H  -0.26823544 -3.2177624 -2.52030686
H  0.45630691 -2.10033392 3.48982714
H  -3.63559641 0.21728909 5.0428705
H  -2.29622433 0.92084663 5.98461523
H  -2.64835374 2.90927865 4.68232804
H  -3.61822958 2.02633632 3.47446855
H  -2.41397001 -4.61502461 4.70957959
H  0.76699523 -2.83152706 6.98192626
H  1.20844954 5.46980743 3.1905317
H  -1.28757247 4.80913986 -0.24043885
H  -2.83842005 -1.98776165 2.44568651
H  -3.71210868 -3.34734663 3.20444232
H  -4.02528499 -1.67693288 3.72192772
H  -0.96098115 -6.03061934 6.00357808
H  0.5964313 -5.38945741 6.58203931
H  -0.85364021 -5.24231562 7.59275309
H  -0.06068969 0.59556125 6.28100674
H  1.20315321 -0.50663703 6.87561723
H  1.15484079 -0.02913207 5.15816455
H  0.93630385 2.40581251 4.64466856
H  1.04665548 4.12454869 5.09019028
H  -0.47425036 3.24016911 5.34641278
H  1.630525 6.23136531 0.27578046
H  0.00491296 6.86230019 -0.07468971
H  0.82125816 7.28239762 1.45118221
H  -2.23173484 2.25931558 -0.3866557
H  -2.95512382 1.76714788 1.14496902
H  -3.40849578 3.32785374 0.40449401
