program: Gaussian 09
title: Step 5 - protocol 1
version: EM64L-G09RevD.01
method: RwB97XD
basis: Gen
operation: Freq
keyword: #P
keyword: #
keyword: WB97XD/CHKBASIS
keyword: GEOM=CHECK
keyword: GUESS=READ
keyword: NOSYMM
keyword: INT=ULTRAFINE#
keyword: SCF=(VSHIFT=300,NOSYM,MAXCYCLE=250)
keyword: CPHF=(GRID=FINEGRID)
keyword: FREQ
title: #P # WB97XD/CHKBASIS # GEOM=CHECK # GUESS=READ # NOSYMM # INT=ULTRAFIN
converged: YES YES YES YES
title: Mulliken charges:
elementType: N C N C C Ru C C C C C C C C C C C C C C C C C C C Cl Ru Cl Cl C C N C C N C C C C C C C C C C C C C C C C C C Cl H H H H H H H H H H H H H H H H H H H H H H H H H H H H H H H H H H H H H H H H H H H H H H H H H H H H H H H H
charge: -0.290429 0.213039 -0.299678 0.067346 0.066904 0.071945 0.067152 0.042005 -0.109496 -0.025872 -0.086879 -0.024673 -0.072683 0.025384 0.008358 0.022056 0.003146 -0.078526 -0.019763 -0.080674 0.018600 -0.061163 0.005009 0.011856 0.022553 -0.373913 -0.041487 -0.281169 -0.400664 0.093699 0.181991 -0.291599 0.065855 0.073712 -0.304656 -0.001769 -0.074584 -0.019231 -0.086854 -0.031285 -0.084037 0.014312 0.007467 0.009782 0.018109 -0.031126 -0.030411 -0.100732 -0.052021 -0.074073 0.016550 0.014638 0.034069 -0.344060 0.087363 0.057678 0.055450 0.053214 0.054843 -0.027205 -0.028232 -0.031564 -0.029214 0.114248 0.032367 0.038902 0.039493 0.058210 0.062668 0.037835 0.037494 0.129561 0.051255 0.063364 0.051046 0.064311 0.045044 0.045229 0.063783 0.054576 0.050186 0.078479 0.089434 0.055669 0.058442 0.062891 0.059372 -0.029118 -0.028615 -0.032103 -0.034839 0.098877 0.039798 0.035725 0.065120 0.038530 0.055992 0.053166 0.071747 0.056889 0.095092 0.039614 0.045472 0.089144 0.038516 0.029458 0.028702 0.113867 0.010678 0.080062
chargesum: 0.00000
title: Mulliken charges with hydrogens summed into heavy atoms:
elementType: N C N C C Ru C C C C C C C C C C C C C C C C C C C Cl Ru Cl Cl C C N C C N C C C C C C C C C C C C C C C C C C Cl
charge: -0.290429 0.213039 -0.299678 0.181457 0.189167 0.071945 0.236648 0.042005 -0.109496 -0.054990 -0.086879 -0.053288 -0.072683 0.199783 0.168002 0.203859 0.003146 -0.078526 -0.051865 -0.080674 -0.016239 -0.061163 0.185188 0.168974 0.175800 -0.373913 -0.041487 -0.281169 -0.400664 0.259541 0.181991 -0.291599 0.178983 0.181769 -0.304656 -0.001769 -0.074584 -0.046436 -0.086854 -0.059518 -0.084037 0.199830 0.167837 0.214671 0.018109 -0.031126 -0.061975 -0.100732 -0.081235 -0.074073 0.182216 0.169223 0.202613 -0.344060
chargesum: -0.00003
polarizability: 5.53831021e+02 2.26471350e+01 6.66298817e+02 -4.78916710e+01 -1.78671495e+01 6.27692350e+02
1716.lowfreq: -0.0048 -0.0023 -0.0021 1.6642 2.7549 4.1668 11.3997 18.0138 23.5269
redmass: 5.2587 5.1672 5.7141 4.2406 4.8638 2.3164 2.8870 1.4473 1.5836 3.7226 2.5984 4.0315 3.4493 4.4139 3.1348 3.6089 3.7052 2.2417 1.7962 1.8885 2.0546 2.2362 1.8411 1.7059 2.5153 4.5254 4.8029 2.2638 2.3870 1.4471 3.0140 3.3722 1.8367 2.8523 3.1134 2.9856 5.8301 1.8865 2.7570 2.7440 4.5826 2.9066 3.0427 2.3263 3.2458 4.2314 3.4642 1.7166 1.3793 2.5396 2.1036 2.4712 2.5357 1.7817 1.5369 2.6538 2.9220 2.2683 3.2228 2.8769 3.1887 2.7303 2.5812 2.7389 3.9813 2.7800 2.8267 4.1761 7.1124 3.9699 3.5783 3.8606 16.7036 9.4661 3.2357 3.3599 5.0932 4.6545 4.4910 8.3924 4.4971 1.4160 2.9796 4.6207 4.2183 4.4196 4.1205 4.1859 3.4788 3.5356 3.5390 3.6790 3.1301 2.9743 3.0006 3.0476 4.4619 4.3344 4.1912 4.3563 4.1004 4.0650 4.1382 4.1659 3.5379 3.5333 3.4466 4.0287 3.3278 3.6031 4.2664 4.3571 5.1388 7.2752 1.4483 4.1632 4.1803 4.1746 4.2458 1.2004 2.3820 2.5841 3.6887 2.7275 1.4831 1.5751 1.2746 1.2717 1.2719 1.2735 1.2971 1.3007 1.2962 1.3027 1.2880 1.3306 2.9690 3.3340 2.1425 2.1493 2.3088 2.1608 3.0362 3.0231 3.8590 3.9090 3.0771 3.2999 1.5947 1.6814 1.5322 1.5312 1.7076 1.6825 1.6639 1.7433 2.0628 1.6874 1.8962 1.5635 1.5809 1.5698 1.5684 1.5898 1.6035 1.6064 1.5876 1.5945 1.5727 1.9633 1.9519 1.6894 3.0268 3.1306 4.2698 4.2702 1.6458 1.6424 1.5499 1.5585 1.3944 1.4015 1.1395 1.1318 1.1049 1.0975 1.3623 1.3503 1.3321 1.3875 3.9049 3.3622 1.9296 1.8478 2.3351 2.2599 3.5635 4.1174 5.0227 3.8859 5.0111 5.8411 2.8634 2.9674 2.9212 2.8946 1.2495 1.2530 1.2574 1.2847 1.2756 1.2372 1.3033 1.2670 1.4829 1.2466 1.6463 1.4847 1.5347 1.4146 1.2985 1.3387 1.3713 1.4339 1.3735 1.3204 1.5792 1.2911 1.0917 1.0836 1.0756 1.0827 1.1605 1.1239 1.0787 1.0652 1.0810 1.0732 1.0725 1.0742 1.0877 1.0937 1.1433 1.1020 1.4057 1.4578 1.3812 1.3823 2.2398 2.1670 2.2371 2.1447 1.4915 1.9946 1.1189 1.3292 3.7977 3.8909 4.1700 4.5896 7.7779 7.9954 8.3582 8.2039 6.8145 6.8610 6.8166 6.9010 1.0603 1.0392 1.0492 1.0399 1.0389 1.0580 1.0381 1.0389 1.0384 1.0385 1.0590 1.0398 1.0442 1.0435 1.0605 1.0391 1.0645 1.0630 1.1069 1.1073 1.1079 1.1008 1.1081 1.1008 1.0982 1.0986 1.1002 1.1006 1.1011 1.1014 1.0984 1.1000 1.0971 1.0902 1.1032 1.1020 1.1034 1.1028 1.1027 1.1028 1.1030 1.1024 1.0911 1.0979 1.0915 1.0915 1.0915 1.0917 1.0990 1.0915 1.0913 1.0986 1.0995 1.0917 1.1044 1.1011
irintensity: 0.0715 0.2268 0.1622 0.0324 0.7732 0.1415 0.0775 0.0798 0.3924 0.9153 0.1063 0.8626 0.5393 0.2731 0.0237 1.8784 1.3026 0.2001 0.1926 0.8262 0.5847 0.9365 0.3060 0.1842 1.1731 1.9484 1.0885 0.8715 1.5177 0.7401 0.1557 2.8996 0.5490 1.4299 0.0732 0.4897 0.7649 0.1868 0.3661 0.2582 10.6197 0.2583 2.5468 0.3949 0.5775 3.1422 2.2185 2.3161 2.6025 3.5245 1.9810 5.6498 6.9624 5.0026 2.9001 0.4456 0.4265 0.0497 0.4572 0.3113 0.3247 0.1655 0.2698 0.3080 2.0193 0.2292 1.3803 1.1009 1.0522 3.5239 6.6632 3.2628 22.7360 20.1533 1.9954 1.8896 4.2460 4.3917 8.8350 93.9174 7.3493 4.4000 0.3805 0.9863 11.1556 6.0382 0.9365 0.4018 0.3087 0.7438 0.6623 0.4987 0.1540 0.3375 0.0518 0.1440 0.1373 0.1531 4.4987 0.3603 5.5232 2.6627 0.5593 0.8562 6.3362 8.2538 6.7202 5.2603 1.1698 5.0598 2.6280 2.2163 6.9898 8.6999 3.9160 1.9342 0.8502 2.9397 2.0933 29.1694 12.9964 20.1484 1.5615 4.4728 11.1135 12.5384 10.9887 2.4824 10.8020 12.9259 48.7613 0.1644 0.7658 0.0478 2.0761 13.9988 3.2644 5.2899 2.1514 3.9261 0.6028 0.4297 0.8958 1.8875 0.1809 0.7897 1.8367 2.4985 7.4259 6.7785 6.9916 0.9215 2.2326 3.5690 2.3193 5.1160 4.5589 2.6934 2.5438 5.1812 1.0250 0.1649 3.1236 3.7749 15.6737 3.1153 7.5840 14.1112 1.9679 1.7487 0.3795 4.7651 0.7056 0.4921 9.0507 9.5751 0.7806 0.6616 1.2951 1.1102 0.8070 0.4450 3.8320 3.9553 2.1712 1.1231 0.7305 0.6487 0.6982 2.0400 1.1284 4.1328 91.6405 176.7699 61.6275 80.9556 31.2810 56.3226 3.8222 23.3716 35.3967 51.8203 0.8282 4.2096 48.2656 35.3541 2.4267 3.3171 6.1464 2.9544 4.5018 8.1426 2.9874 0.4218 6.5797 1.2729 14.2088 0.7145 0.4510 1.3689 0.8760 6.2825 8.8282 3.2636 11.5183 16.1136 29.0485 43.6220 13.7186 10.9985 8.4443 0.7584 24.2731 0.0580 1.0945 2.9081 5.3775 11.8279 18.5092 19.9889 4.6428 8.8591 10.6452 5.4519 45.3416 52.9120 41.8720 31.2827 12.5902 10.6013 28.9713 20.4522 49.4865 90.1380 16.3336 38.1865 249.4199 302.0570 20.6492 88.8470 5.9733 4.8267 7.6807 10.0763 27.2755 8.2239 28.4513 5.8281 19.2110 22.5219 31.2235 34.4857 25.3386 22.1060 27.8715 33.5242 37.0776 36.3282 25.2447 5.5227 24.5695 20.8005 26.4026 29.3123 63.8410 49.6746 4.9256 2.2563 20.3785 10.8704 21.1027 16.4010 16.7422 7.9061 18.4757 10.4503 11.5683 8.6790 12.2281 4.8669 6.4379 6.7429 17.6994 13.7319 9.1462 10.3623 11.6292 11.3273 9.1449 12.4701 11.7695 5.3665 15.3568 8.6978 15.2773 8.6564 7.2706 13.7180 17.6505 3.6654 6.4817 0.7498 1.2371 2.5458
temp: 298.150 k
press: 1.00000 atm
elementType: 7 6 7 6 6 44 6 6 6 6 6 6 6 6 6 6 6 6 6 6 6 6 6 6 6 17 44 17 17 6 6 7 6 6 7 6 6 6 6 6 6 6 6 6 6 6 6 6 6 6 6 6 6 17 1 1 1 1 1 1 1 1 1 1 1 1 1 1 1 1 1 1 1 1 1 1 1 1 1 1 1 1 1 1 1 1 1 1 1 1 1 1 1 1 1 1 1 1 1 1 1 1 1 1 1 1 1 1 1 1
symmnumber: 1
zpe: 2380241.0 jmol-1
zpe.correction: 0.906586 hartree
zpe.thermalcorrener: 0.969802 hartree
zpe.thermalcorrenthalpy: 0.970746 hartree
zpe.thermalcorrgfe: 0.802970 hartree
zpe.sumelectzpe: -3958.293859 hartree
zpe.sumelectthermal: -3958.230643 hartree
zpe.sumelectthermalent: -3958.229699 hartree
zpe.sumelectthermalfe: -3958.397475 hartree
dipole: -6.2356 -0.4462 -3.5018
dipole: 7.1655
quadrupole: -443.2076 -360.0215 -462.4159
quadrupole: -91.4548 -147.2375 -41.4691
quadrupole: -21.3259 61.8601 -40.5342 -91.4548 -147.2375 -41.4691
hfenergy: -3959.2004448 hartree
pointgroup: C01 [X(C44H56Cl4N4Ru2)]
dipole: -2.453258 -0.1755423 -1.3777196 debye
polarizability: 553.8310208|22.647135|666.2988166|-47.891671|-17.8671495|627.6923501 unknown
InChI: InChI=1S/2C21H26N2.2CH2.4ClH.2Ru/c2*1-14-9-16(3)20(17(4)10-14)22-7-8-23(13-22)21-18(5)11-15(2)12-19(21)6;;;;;;;;/h2*9-12H,7-8H2,1-6H3;2*1H2;4*1H;;/q;;;;;;;;2*+2/p-4
charge 0 multiplicity 1
110 atoms
N  5.06631145 14.76473168 20.1117901
C  5.03634941 13.41020116 20.13328085
N  3.88789308 13.03207648 20.7395209
C  3.0580657 14.16614425 21.15233183
C  3.92092613 15.37597262 20.78463402
Ru 6.61216778 12.35090386 19.66031594
C  5.88337603 10.80915602 19.13200835
C  3.35868272 11.71253562 20.88868253
C  2.62589171 11.16710794 19.81687131
C  2.09273412 9.89014369 19.96556422
C  2.2577726 9.15679593 21.14701066
C  2.95000291 9.74693295 22.19978734
C  3.49815965 11.03222167 22.10181055
C  2.45361137 11.92855556 18.53007386
C  1.69430404 7.76411358 21.26123229
C  4.16794497 11.64347183 23.30293028
C  5.89594428 15.55205345 19.24846573
C  7.0511933 16.16143709 19.74641847
C  7.84927801 16.87346465 18.84612073
C  7.51597249 16.98535801 17.49572876
C  6.33119713 16.39683325 17.04693644
C  5.50769684 15.67762269 17.90677352
C  7.42857472 16.04145173 21.20002244
C  8.42549844 17.67250628 16.51375486
C  4.29496365 14.96252458 17.3829142
Cl 8.57453002 14.21842865 14.70783083
Ru 7.02966284 12.49788168 15.16848357
Cl 7.50401047 13.17766625 17.67217471
Cl 4.95296318 11.55787722 15.81973438
C  8.13109485 11.10717833 15.4218621
C  6.54117726 12.24316139 13.24777479
N  6.72995156 11.21126213 12.39394543
C  6.13132071 11.41567585 11.07327933
C  5.40033778 12.74611293 11.23678236
N  5.78621551 13.15909869 12.58476807
C  7.59184544 10.08706454 12.55906047
C  7.04686449 8.86620596 12.96943296
C  7.91039956 7.77492343 13.09818613
C  9.27464047 7.88164811 12.82445256
C  9.78035522 9.12007412 12.41588364
C  8.95803252 10.23724535 12.27609601
C  5.58744156 8.75670685 13.31834749
C  10.19071197 6.69211509 12.95495069
C  9.52581582 11.58542464 11.92084292
C  5.43555904 14.47909721 13.01259503
C  6.29652424 15.54321203 12.68301886
C  5.94267242 16.82925411 13.08665443
C  4.74194755 17.08996342 13.75110648
C  3.8696108 16.02686616 13.97474837
C  4.19112343 14.71371209 13.61599242
C  7.53019938 15.34274342 11.84371477
C  4.41465733 18.4748617 14.24315414
C  3.17301607 13.62664268 13.83402651
Cl 7.24888596 12.17842494 21.87729263
H  8.44879523 10.34985594 14.69665408
H  5.45639271 10.5831787 10.82662338
H  6.91840936 11.45076204 10.30323291
H  5.7150444 13.50126458 10.50126243
H  4.3055751 12.64237714 11.17319753
H  7.50363848 6.81697243 13.43231678
H  10.85005346 9.22243731 12.21457509
H  6.62439669 17.65472449 12.86584811
H  2.90180979 16.21765725 14.44742179
H  5.32312914 9.46571741 14.11878519
H  5.34043998 7.74017158 13.65284083
H  4.94615117 8.99009681 12.45335372
H  9.69905047 5.85985084 13.47740895
H  11.10376698 6.95328347 13.51052637
H  10.50354499 6.32867788 11.96295674
H  8.99837668 12.04145527 11.06824133
H  10.58826475 11.50585951 11.65539644
H  9.43258613 12.28405398 12.76933021
H  7.92480244 14.32386441 11.91981076
H  8.32876454 16.02683468 12.15907533
H  7.29854718 15.55775773 10.78597534
H  4.77672062 18.60469727 15.27699202
H  3.33022633 18.65648399 14.24788657
H  4.89282934 19.24781706 13.6247604
H  2.84998102 13.60305031 14.88502124
H  3.56818447 12.63147332 13.60443054
H  2.28421033 13.81796969 13.21136131
H  8.55842911 10.99879623 16.43526906
H  4.82538518 10.53451288 19.04971258
H  2.09352341 14.14606223 20.62009459
H  2.85160193 14.10386627 22.23068419
H  4.25704911 15.93866134 21.6687101
H  3.41248781 16.0771865 20.10671429
H  1.53460457 9.45104661 19.1343862
H  3.07068463 9.19837359 23.13777291
H  8.7701735 17.33565525 19.21090821
H  6.07244985 16.45271982 15.987001
H  3.41124023 12.0412826 17.99864135
H  1.76299281 11.40459544 17.85625669
H  2.0570321 12.94054092 18.70393521
H  2.22890425 7.07118297 20.59238588
H  1.78023799 7.37630077 22.28561116
H  0.63206224 7.74094992 20.97388002
H  3.41624739 11.87489282 24.07538322
H  4.89236347 10.94256924 23.7408372
H  4.71742567 12.55717454 23.05216836
H  7.45273052 14.99289837 21.53358428
H  8.41834056 16.48065327 21.38282547
H  6.7059244 16.57021838 21.84313258
H  8.90869011 16.91616799 15.87462638
H  7.86091368 18.34877314 15.85364536
H  9.20913186 18.25418032 17.0192634
H  3.99810736 15.37290811 16.41119504
H  4.52127977 13.89394077 17.23424529
H  3.43389463 15.02843002 18.06479285
H  6.60902013 10.01626909 18.85617946
