program: Gaussian 16
title: SP+PCM(CHCl3)
version: ES64L-G16RevC.01
method: RPBEPBE
basis: GenECP
operation: SP
keyword: #P
keyword: #
keyword: PBEPBE/GENECP
keyword: 5D
keyword: 7F
keyword: GEOM=CHECK
keyword: GUESS=READ
keyword: NOSYMM
keyword: GFINPUT#
keyword: EMPIRICALDISPERSION=GD3BJ
keyword: IOP(3/174=1000000,3/175=358940,3/177=12092,3/178=5938951)
keyword: SCRF=(PCM,SOLVENT=CHLOROFORM,READ)
keyword: SCF=(VSHIFT=300,NOVARACC,MAXCYCLE=180,CONVER=5)
keyword: INT=(ULTRAFINE)
keyword: SP
title: #P # PBEPBE/GENECP 5D 7F # GEOM=CHECK # GUESS=READ # NOSYMM # GFINPUT
basis: NPDir=0 NMtPBC= 1 NCelOv= 1 NCel= 1 NClECP= 1 NCelD= 1
basis: NCelK= 1 NCelE2= 1 NClLst= 1 CellRange= 0.0.
basis: One-electron integrals computed using PRISM.
basis: 1 Symmetry operations used in ECPInt.
basis: ECPInt: NShTT= 1043290 NPrTT= 3343662 LenC2= 656766 LenP2D= 1365302.
basis: LDataN: DoStor=T MaxTD1=10 Len= 848
basis: Number of processors reduced to 19 by ecpmxn.
basis: NBasis= 4964 RedAO= T EigKep= 1.30D-06 NBF= 4964
basis: NBsUse= 4962 1.00D-06 EigRej= 9.02D-07 NBFU= 4962
hfenergy: -3925.4714125 hartree
pointgroup: C01 [X(C46H58Cl4N2Ru2)]
dipole: 1.2690198 -0.4345536 0.0444707 debye
InChI: InChI=1S/2C22H27N.2CH2.4ClH.2Ru/c2*1-16-12-17(2)20(18(3)13-16)23-15-22(6,14-21(23,4)5)19-10-8-7-9-11-19;;;;;;;;/h2*7-13H,14H2,1-6H3;2*1H2;4*1H;;/q;;;;;;;;2*+2/p-4
charge 0 multiplicity 1
112 atoms
Ru -1.01497931 0.2997429 -1.71602189
Ru -1.46769133 -0.58969433 1.83704721
C  -0.70275456 -0.78610912 -3.33312785
Cl -1.44143157 1.46329277 0.62619089
Cl -2.08501078 -1.49590673 -0.56851392
Cl 0.68708922 1.86394986 -2.09437666
C  -2.39098421 1.24129172 -2.37072276
C  -0.8703169 0.08159417 3.59700228
C  -3.21071837 -0.68306655 2.24357186
Cl -0.61790798 -2.72649266 2.29672663
N  0.27565399 0.72222984 3.81337409
C  -1.53626292 -0.13522611 4.97920638
C  0.63375883 0.97789942 5.2563263
C  1.19068415 1.12407164 2.7661331
C  -0.33846096 0.02208685 5.94086548
H  -0.6351205 0.37477632 6.93719864
H  0.14280288 -0.96109208 6.05868631
C  2.15054996 0.2062873 2.30456528
C  1.13130463 2.42949706 2.24287803
C  2.31817048 -1.19586863 2.83112423
C  3.03341558 0.62180286 1.30640419
H  2.2982429 -1.91034994 1.99586903
H  3.29195873 -1.29344486 3.33749397
H  1.52638185 -1.50195984 3.52124926
H  3.77592471 -0.08990448 0.94664553
C  2.99645164 1.89964218 0.76067673
C  3.91915282 2.28623529 -0.36125058
C  2.04052493 2.7866783 1.24892432
H  3.4375946 2.04714812 -1.32307013
H  4.1378465 3.36361805 -0.35418557
H  4.87037701 1.73630644 -0.30850605
H  1.97099957 3.78809808 0.81763522
C  0.11442528 3.46282563 2.65548817
H  0.58459692 4.26173992 3.25026905
H  -0.32083342 3.92380699 1.758775
H  -0.7059066 3.04111116 3.24240493
C  -1.69574042 -1.0867851 -4.48270611
N  0.39817326 -1.49733681 -3.56858515
C  -1.10801527 -2.37367247 -5.10454796
H  -1.54682637 -3.24396915 -4.59230804
H  -1.33005982 -2.46467323 -6.17581122
C  0.39063328 -2.33562283 -4.82569394
C  1.52965798 -1.57617706 -2.66989198
C  2.66439937 -0.77216851 -2.88447408
C  1.50460843 -2.53213995 -1.63518033
C  2.77679098 0.26417805 -3.97236804
C  3.76709845 -0.95103196 -2.04776945
H  3.48056519 -0.06990912 -4.75126732
H  1.81644837 0.49352886 -4.44066144
H  3.16449307 1.20171877 -3.55201869
H  4.64761046 -0.32405547 -2.21161295
C  3.77833881 -1.88926124 -1.01760227
C  5.00201613 -2.09807713 -0.16352271
C  2.63182923 -2.65267422 -0.81845379
H  4.72957367 -2.33314168 0.87615766
H  5.60184821 -2.94051339 -0.54390162
H  5.64851857 -1.20831934 -0.15830914
H  2.60716191 -3.39321323 -0.01429908
C  0.3682458 -3.48753714 -1.37753767
H  0.03872232 -3.41229203 -0.33133048
H  -0.50716309 -3.30073205 -2.00676549
H  0.71151728 -4.52034193 -1.54822082
H  -3.90228212 -1.10614045 1.49472637
H  -3.681489 -0.31887989 3.16882939
H  -2.66243355 1.3320695 -3.43336796
H  -2.98470618 1.85772167 -1.67346286
C  2.09008991 0.62098706 5.54726299
H  2.30565313 -0.43126383 5.32660552
H  2.282056 0.78959145 6.61748649
H  2.78346009 1.25248783 4.97300164
C  0.39875684 2.43813367 5.65640691
H  -0.63152504 2.7639192 5.46772184
H  0.5955352 2.53975955 6.73415594
H  1.09002963 3.1068378 5.12648673
C  -3.11284341 -1.40639133 -3.97128761
H  -3.691389 -1.88731422 -4.7745068
H  -3.65964344 -0.51486367 -3.64493708
H  -3.0656915 -2.1012719 -3.12127845
C  1.17470028 -1.6660366 -5.95987437
H  1.02925849 -2.25491577 -6.877872
H  2.25030693 -1.65137386 -5.74130323
H  0.83431364 -0.64207895 -6.15695923
C  0.96929439 -3.72955739 -4.59316992
H  0.41512639 -4.28404096 -3.82702698
H  2.02844243 -3.68477882 -4.3008744
H  0.90076186 -4.29312282 -5.53566232
C  -1.71928324 0.0554975 -5.50904402
C  -1.78129239 2.07023374 -7.47946198
C  -0.9313541 1.20530634 -5.38515538
C  -2.5417033 -0.06231287 -6.63758205
C  -2.57420984 0.93092874 -7.61231959
C  -0.962933 2.20179159 -6.36130926
H  -0.29425831 1.34930247 -4.50989448
H  -3.16862469 -0.94766032 -6.76535612
H  -3.22418985 0.81295577 -8.48150586
H  -0.34002618 3.08907914 -6.23484094
H  -1.80517193 2.85042967 -8.24228157
C  -2.13475418 -1.53933189 5.17159343
H  -2.34150287 -1.70134151 6.24041116
H  -1.42797681 -2.30702072 4.83085301
H  -3.07144064 -1.6805305 4.62090357
C  -2.59752371 0.94630513 5.24373586
C  -4.52190887 2.91912809 5.84904164
C  -3.21861142 0.99177825 6.4995212
C  -2.97008011 1.90513384 4.29534453
C  -3.91974103 2.88238 4.59508971
C  -4.16799175 1.96372832 6.80113728
H  -2.95615813 0.25676436 7.26367087
H  -2.52813838 1.89220512 3.2983918
H  -4.18674449 3.61700092 3.83332416
H  -4.63381156 1.97453306 7.7884131
H  -5.26442481 3.6836403 6.08394478
