program: Gaussian 16
title: SP+PCM(CHCl3)
version: ES64L-G16RevC.01
method: RPBEPBE
basis: GenECP
operation: SP
keyword: #P
keyword: #
keyword: PBEPBE/GENECP
keyword: 5D
keyword: 7F
keyword: GEOM=CHECK
keyword: GUESS=READ
keyword: NOSYMM
keyword: GFINPUT#
keyword: EMPIRICALDISPERSION=GD3BJ
keyword: IOP(3/174=1000000,3/175=358940,3/177=12092,3/178=5938951)
keyword: SCRF=(PCM,SOLVENT=CHLOROFORM,READ)
keyword: SCF=(VSHIFT=300,NOVARACC,MAXCYCLE=180,CONVER=5)
keyword: INT=(ULTRAFINE)
keyword: SP
title: #P # PBEPBE/GENECP 5D 7F # GEOM=CHECK # GUESS=READ # NOSYMM # GFINPUT
basis: NPDir=0 NMtPBC= 1 NCelOv= 1 NCel= 1 NClECP= 1 NCelD= 1
basis: NCelK= 1 NCelE2= 1 NClLst= 1 CellRange= 0.0.
basis: One-electron integrals computed using PRISM.
basis: 1 Symmetry operations used in ECPInt.
basis: ECPInt: NShTT= 261003 NPrTT= 837199 LenC2= 209467 LenP2D= 456259.
basis: LDataN: DoStor=T MaxTD1=10 Len= 848
basis: NBasis= 2482 RedAO= T EigKep= 1.56D-06 NBF= 2482
basis: NBsUse= 2482 1.00D-06 EigRej= -1.00D+00 NBFU= 2482
hfenergy: -1962.7001234 hartree
pointgroup: C01[X(C23H29Cl2N1Ru1)]
dipole: 2.3700884 0.4297813 2.2939564 debye
InChI: InChI=1S/C22H27N.CH2.2ClH.Ru/c1-16-12-17(2)20(18(3)13-16)23-15-22(6,14-21(23,4)5)19-10-8-7-9-11-19;;;;/h7-13H,14H2,1-6H3;1H2;2*1H;/q;;;;+2/p-2
charge 0 multiplicity 1
56 atoms
Ru -1.08545656 -0.37828898 -0.34821846
C  0.11151841 1.62661152 1.74844971
N  1.59608336 0.13559357 0.73024863
C  0.30426754 0.45254143 0.74291065
C  2.4934335 0.86588747 1.69383366
C  1.51435106 1.8225014 2.38757964
H  1.84487552 2.86328295 2.28941768
H  1.47226295 1.59861099 3.4620365
C  3.62084587 1.60046859 0.96532505
H  3.2395452 2.3915939 0.30803513
H  4.23699209 0.90625187 0.37554106
H  4.26933837 2.07836504 1.7142724
C  3.11920895 -0.09969378 2.7045665
H  3.72950651 0.48526328 3.40860264
H  3.77393027 -0.83597233 2.21756345
H  2.35224308 -0.63017227 3.28349287
C  -0.88488898 1.26059066 2.85260874
H  -0.87871477 2.04371136 3.62504987
H  -0.58813103 0.31751992 3.33673107
H  -1.9081395 1.15449074 2.47360835
C  -0.29239383 2.90901619 1.00943236
C  -1.39977111 3.67071011 1.38276095
H  -2.05299832 3.34470384 2.1909064
C  -1.70800772 4.85875643 0.71929167
H  -2.58361186 5.43274317 1.02778508
C  -0.91654334 5.30523676 -0.33290739
H  -1.16375461 6.23028514 -0.85627626
C  0.19176873 4.55178577 -0.71749517
H  0.81700986 4.87814492 -1.55039544
C  0.49630776 3.37279202 -0.04950804
H  1.3511071 2.78490421 -0.38177119
C  2.19206479 -0.89163039 -0.09214754
C  2.63447555 -0.56537354 -1.38702068
C  3.3145077 -1.54006155 -2.1114569
H  3.65584247 -1.29896606 -3.12149154
C  3.54644848 -2.81987593 -1.60010359
C  3.01867167 -3.12926229 -0.35216299
H  3.11635126 -4.14686736 0.03500904
C  2.31198484 -2.19301493 0.40811946
C  2.32294949 0.75703776 -2.03965011
H  1.26669193 1.03743604 -1.90804555
C  1.61465782 -2.66946505 1.65641722
H  0.93625154 -1.91462865 2.07033155
Cl -1.98663329 1.50214613 -1.30582557
Cl -0.36084858 -2.33446499 -1.33142301
C  -2.08608617 -0.97629311 1.01470048
H  -1.84674098 -1.02094434 2.08427806
H  -3.06029358 -1.4167317 0.72619825
H  1.00316276 -3.54678892 1.40065088
H  2.32890498 -2.96826375 2.43859288
H  2.93707272 1.57775305 -1.64254735
H  2.51323003 0.69675583 -3.1189767
C  4.29347531 -3.84219424 -2.41547061
H  5.30683752 -3.48849148 -2.66110377
H  3.77434523 -4.03718496 -3.36656878
H  4.38679197 -4.79636154 -1.87898122
