program: Gaussian 16
title: -15.99539837
version: ES64L-G16RevC.01
method: RB3LYP
basis: 6-31+G(d,p)
operation: Freq
keyword: #N
keyword: Geom=AllCheck
keyword: Guess=TCheck
keyword: SCRF=Check
keyword: GenChk
keyword: RB3LYP/6-31+G(d,p)
keyword: Freq
keywords: q
keyword: Fre
hfenergy: -3714.5535162 hartree
pointgroup: C01 [X(C37H35Cl1F12N2O3Si1)]
dipole: -2.0946741 -0.7100038 1.744448 debye
polarizability: 548.3836934|0.0414701|457.4431421|-25.6476699|6.6573005|445.2162597 unknown
InChI: InChI=1S/C37H35ClF12N2O3Si/c1-19(2)29(38)30(52-31(53)26-9-6-7-10-27(26)32(52)54)51-12-8-11-28(51)33(55-56(3,4)5,20-13-22(34(39,40)41)17-23(14-20)35(42,43)44)21-15-24(36(45,46)47)18-25(16-21)37(48,49)50/h6-7,9-10,13-19,28-30H,8,11-12H2,1-5H3
charge 0 multiplicity 1
91 atoms
C  -0.53624629 -2.80296282 -0.330732
C  -0.4345834 -0.80870885 1.0633602
C  -0.3417808 -2.05698016 1.96007967
C  0.09034419 -3.18765775 1.01577471
H  -1.49303133 -3.31086634 -0.47181914
H  0.1111419 -3.07545144 -1.17074066
H  -1.24888639 -0.17301465 1.4094634
H  -1.33801747 -2.26612015 2.36484132
H  1.17800361 -3.23709059 0.94081376
H  -0.25888504 -4.16697596 1.3532632
N  -0.73208926 -1.32866048 -0.28779268
C  -1.93261157 -0.82736098 -0.90560722
H  -1.90975487 0.2594223 -0.86768046
C  -2.04210043 -1.2405956 -2.38670813
H  -2.27326039 -2.30116772 -2.46531313
C  -0.79735736 -0.92258526 -3.22617995
H  0.00483129 -1.48434641 -2.73593622
C  -0.93232095 -1.47814189 -4.64922192
H  0.01906097 -1.377158 -5.17984965
H  -1.20225755 -2.53962155 -4.63850156
H  -1.69837315 -0.93843364 -5.21349668
C  -0.40952477 0.55961232 -3.23920857
H  0.50053373 0.69954747 -3.83009889
H  -1.2018342 1.16755493 -3.6856179
H  -0.21484404 0.94339991 -2.23592913
Cl -3.53078865 -0.41130759 -3.06664744
C  -5.22778162 -2.06741275 0.48573576
N  -3.19259538 -1.16468675 -0.16818588
C  -3.84614642 -0.19680572 0.61449489
O  -3.39901979 0.90492961 0.88581646
C  -3.98811327 -2.32362417 -0.29935984
O  -3.69730315 -3.32856143 -0.92062211
C  0.86898758 0.07475107 1.12212094
C  2.05406542 -0.73855633 0.60750339
C  2.99968111 -1.25599406 1.49019091
C  2.17553129 -1.02042691 -0.75721511
C  4.03104678 -2.07417103 1.01774827
H  2.91852294 -1.02002566 2.54345397
C  3.2009109 -1.84201915 -1.21958663
H  1.46338357 -0.60097687 -1.45278402
C  4.13648811 -2.38570332 -0.33592516
H  4.93404321 -3.02200081 -0.6969376
C  0.74734043 1.399353 0.35159703
C  -0.46917113 2.06842485 0.20642662
C  1.9092878 2.03255356 -0.10851228
C  -0.52527652 3.31631686 -0.42213217
H  -1.39342096 1.64728016 0.57869275
C  1.84882517 3.27934274 -0.72588905
H  2.87226914 1.55487986 0.02166301
C  0.62679826 3.93152348 -0.90086817
H  0.57832108 4.89741996 -1.3868356
C  -1.87142824 3.97592922 -0.5766247
C  3.11426509 3.89971768 -1.25691918
C  3.24939292 -2.17671863 -2.68547705
C  5.01889383 -2.62121266 2.01286859
O  1.12816618 0.37010969 2.48741058
C  1.3363165 0.92383424 5.19628489
H  2.42697144 0.97657494 5.11035171
H  1.03362695 1.56167615 6.03448856
H  1.06627667 -0.10854301 5.44326265
C  -1.35912866 1.33127664 3.75965202
H  -1.70093379 1.95115417 4.59757792
H  -1.90080707 1.66231722 2.86947264
H  -1.65571039 0.29792439 3.97220052
C  1.01989943 3.23472887 3.18432684
H  0.81629272 3.89063065 4.03918542
H  2.09291633 3.28680329 2.971194
H  0.48210512 3.63745783 2.32232196
Si 0.50962778 1.47493949 3.60502488
F  4.40732779 -3.39799052 2.94695744
F  5.64830929 -1.62885816 2.69348302
F  5.9778552 -3.37877798 1.43341167
F  4.45404908 -2.65182313 -3.0723236
F  2.96854994 -1.10035644 -3.46170972
F  2.32813885 -3.12970611 -3.00824856
F  3.40765294 3.44383531 -2.50383395
F  4.18535836 3.61398182 -0.4770809
F  3.02636813 5.24789966 -1.34343277
F  -1.78217355 5.20121314 -1.14705661
F  -2.48784532 4.13735733 0.62103529
F  -2.70251839 3.23537619 -1.35041411
H  0.33495117 -1.91244532 2.80346128
C  -5.14084119 -0.78910934 1.03743544
C  -6.15330373 -0.26447904 1.82765006
C  -6.33222061 -2.87861607 0.70125026
C  -7.2760148 -1.07409626 2.05009584
H  -6.07443518 0.73229276 2.2480588
C  -7.36373643 -2.35921183 1.49639215
H  -6.39032515 -3.87039533 0.26592423
H  -8.09298445 -0.7010397 2.65945154
H  -8.24743304 -2.96012644 1.6860686
