program: Gaussian 16
title: -11.29539395
version: AS64L-G16RevC.01
method: RB3LYP
basis: 6-31+G(d,p)
operation: Freq
keyword: #N
keyword: Geom=AllCheck
keyword: Guess=TCheck
keyword: SCRF=Check
keyword: GenChk
keyword: RB3LYP/6-31+G(d,p)
keyword: Freq
keywords: q
keyword: Fre
hfenergy: -3201.7418755 hartree
pointgroup: C01 [X(C29H31Cl1F12N1O1Si1)]
dipole: 2.9861195 -2.6212087 1.0797239 debye
polarizability: 413.8835534|-22.4179188|376.293721|-19.3375023|-12.2853108|335.0817522 unknown
InChI: InChI=1S/C29H31ClF12NOSi/c1-16(2)23(30)15-43-8-6-7-24(43)25(44-45(3,4)5,17-9-19(26(31,32)33)13-20(10-17)27(34,35)36)18-11-21(28(37,38)39)14-22(12-18)29(40,41)42/h9-16,23-24H,6-8H2,1-5H3
charge 1 multiplicity 1
76 atoms
C  2.56602217 -0.20406291 2.29169463
C  0.26487741 -0.90589398 1.68518094
C  0.20618487 0.05344004 2.88189511
C  1.56919119 0.77362671 2.92529752
H  3.13886867 -0.76380501 3.03559205
H  3.25327341 0.27394633 1.59098835
H  -0.20970978 -1.86306534 1.89622352
H  0.0512195 -0.52872963 3.79434382
H  1.54134844 1.70311037 2.35846452
H  1.86087901 1.0195792 3.94746791
N  1.72477626 -1.19077578 1.54990447
C  2.1799243 -2.24478027 0.96703948
H  1.45176203 -2.91715137 0.52517242
C  3.6224849 -2.63340278 0.9292132
H  4.28689405 -1.79444621 1.13863395
C  4.03345848 -3.33902938 -0.36780658
H  3.36254468 -4.19684423 -0.50630518
C  3.84063048 -2.35636612 -1.53381408
H  4.47605142 -1.47283015 -1.41984951
H  4.11008092 -2.83993412 -2.47620047
H  2.80178362 -2.02581309 -1.62480433
C  5.47961071 -3.83867024 -0.30011652
H  6.17399386 -3.00568074 -0.14214097
H  5.62425212 -4.56620381 0.5011475
H  5.74654877 -4.3196124 -1.24470848
Cl 3.71947594 -3.7333572 2.39501152
C  -0.33187353 -0.4119314 0.31640791
C  -1.84610198 -0.19315824 0.44756736
C  -2.49925406 0.66126432 -0.44725505
C  -2.62391349 -0.92110291 1.35203646
C  -3.88786169 0.7831459 -0.43587699
H  -1.93087581 1.23297644 -1.16972192
C  -4.01312555 -0.78946985 1.36595539
H  -2.17621339 -1.61291036 2.05422508
C  -4.66066667 0.06186921 0.47289964
H  -5.73890238 0.15793733 0.48214493
C  0.40561171 0.85408547 -0.13545006
C  0.04466118 2.12460602 0.32619099
C  1.52419264 0.73752554 -0.96034111
C  0.79403724 3.24698682 -0.02781216
H  -0.82586285 2.25483663 0.95809362
C  2.27699544 1.8616875 -1.30256107
H  1.79910688 -0.23344801 -1.34559544
C  1.92207134 3.1280086 -0.83982817
H  2.50103773 4.00163454 -1.11230246
C  0.38471429 4.58648302 0.53735791
C  3.52158579 1.6640038 -2.12917962
C  -4.7919437 -1.59515706 2.37797581
C  -4.52659186 1.70738761 -1.44519738
O  -0.05727038 -1.48572138 -0.56778656
C  0.26289934 -3.51519733 -2.44680291
H  0.3507756 -4.2304543 -1.62110493
H  -0.17427984 -4.05501702 -3.294127
H  1.26702342 -3.20112672 -2.74515853
C  -0.80932135 -0.74964557 -3.32499722
H  -1.13924602 -1.19411283 -4.27140371
H  -1.48288092 0.08564524 -3.11549982
H  0.19698679 -0.34922557 -3.48437235
C  -2.56997765 -2.67013441 -1.62472488
H  -3.28879388 -1.86113913 -1.47825541
H  -2.91872212 -3.26638885 -2.47619112
H  -2.59431441 -3.31590787 -0.74094796
Si -0.83507628 -2.06529768 -1.99101069
F  -5.8662539 1.74389526 -1.33281342
F  -4.22845439 1.31454985 -2.71106507
F  -4.06236203 2.97250491 -1.30943217
F  -4.49091616 -2.91543339 2.2819502
F  -6.1212711 -1.46451641 2.22742799
F  -4.47901126 -1.21683017 3.64336526
F  3.31951274 0.78041612 -3.13560221
F  4.52500818 1.14443972 -1.35774651
F  3.98088227 2.80634813 -2.66311786
F  -0.94230828 4.79819736 0.39313996
F  1.03675353 5.60941293 -0.04340395
F  0.64900773 4.6367042 1.87177901
H  -0.62875028 0.74987812 2.79977439
