program: Orca
programVersion: 4.2.1
elementType: C C C C C C H H H H C H H O C C H H H C H H H C H H H
charge: 1
multiplicity: 1
keywords: WB97X-D3 OPT FREQ def2-TZVPP grid5 nofinalgrid gridx6 pal8
frequency: 0.00 0.00 0.00 0.00 0.00 0.00 18.12 37.69 55.22 73.25 87.52 123.55 162.19 174.08 226.72 267.56 346.22 362.63 389.26 440.48 466.82 472.25 475.30 525.22 634.57 683.74 743.32 773.14 798.32 825.21 831.88 852.94 886.93 898.45 966.25 984.99 992.46 993.70 1002.50 1019.87 1027.56 1037.88 1092.25 1093.11 1113.33 1163.44 1206.48 1276.62 1320.84 1364.72 1390.01 1422.44 1428.14 1446.88 1455.94 1465.93 1473.76 1484.23 1495.62 1507.89 1545.33 1564.99 1625.09 1679.49 1718.58 1729.31 3052.31 3059.63 3119.97 3124.70 3147.73 3148.52 3161.10 3173.38 3197.09 3216.20 3218.89 3233.67 3238.75 3243.61 3273.37
frequency: 18.12 37.69 55.22 73.25 87.52 123.55 162.19 174.08 226.72 267.56 346.22 362.63 389.26 440.48 466.82 472.25 475.30 525.22 634.57 683.74 743.32 773.14 798.32 825.21 831.88 852.94 886.93 898.45 966.25 984.99 992.46 993.70 1002.50 1019.87 1027.56 1037.88 1092.25 1093.11 1113.33 1163.44 1206.48 1276.62 1320.84 1364.72 1390.01 1422.44 1428.14 1446.88 1455.94 1465.93 1473.76 1484.23 1495.62 1507.89 1545.33 1564.99 1625.09 1679.49 1718.58 1729.31 3052.31 3059.63 3119.97 3124.70 3147.73 3148.52 3161.10 3173.38 3197.09 3216.20 3218.89 3233.67 3238.75 3243.61 3273.37
formula: C11H15O
InChI: InChI=1S/C7H7O.C4H8/c1-6-2-4-7(8)5-3-6;1-4(2)3/h2-5,8H,1H2;1H2,2-3H3
27 atoms
C  -0.632611 0.637482 0.354398
C  -1.823772 1.030167 1.032895
C  -3.002379 0.490149 0.664266
C  -3.076351 -0.479359 -0.405628
C  -1.849179 -0.855148 -1.069432
C  -0.666442 -0.318812 -0.705082
H  -1.739934 1.757865 1.828107
H  -3.917914 0.776358 1.167402
H  -1.896689 -1.581745 -1.871453
H  0.258554 -0.592959 -1.194587
C  -4.254019 -1.017701 -0.775718
H  -5.179795 -0.7432 -0.284313
H  -4.316852 -1.7440 -1.577195
O  0.465687 1.186549 0.747638
C  3.176727 -0.227604 0.043385
C  2.95307 0.741806 -0.850082
H  3.201354 1.775328 -0.635197
H  2.614653 0.51735 -1.855665
H  1.272145 0.893092 0.24514
C  3.726939 0.057335 1.409166
H  4.693616 -0.436396 1.527959
H  3.07373 -0.347486 2.185962
H  3.864086 1.122959 1.584196
C  2.917364 -1.671728 -0.269963
H  3.842384 -2.244126 -0.17671
H  2.536204 -1.813646 -1.280919
H  2.213617 -2.107743 0.444306
totalener: -503.17536615 hartree
nucrepener: 649.71755808 hartree
electener: -1152.89292424 hartree
oneelecener: -1953.61399936 hartree
twoeener: 800.72107512 hartree
kineticenergy: 500.82124924 hartree
xcener: -50.357437738708 hartree
chargesum: 1.0000000
charge: 0.371167 -0.129665 -0.012665 -0.073151 -0.045955 -0.143558 0.160741 0.151059 0.150047 0.124748 0.062995 0.132429 0.131214 -0.205738 -0.074316 -0.304570 0.133687 0.123672 0.210185 -0.153572 0.111777 0.083733 0.091585 -0.190359 0.120088 0.084505 0.089916
charge: -0.123267 0.032078 0.097382 -0.106183 0.099804 0.016220 0.045445 0.049108 0.048908 0.035077 0.237509 0.035827 0.035138 0.471077 -0.109792 0.008845 0.009995 0.003090 -0.093337 0.025952 0.034659 0.024401 0.025979 0.018318 0.036447 0.018752 0.022569
qa: 0.3712 -0.1297 -0.0127 -0.0732 -0.0460 -0.1436 0.1607 0.1511 0.1500 0.1247 0.0630 0.1324 0.1312 -0.2057 -0.0743 -0.3046 0.1337 0.1237 0.2102 -0.1536 0.1118 0.0837 0.0916 -0.1904 0.1201 0.0845 0.0899
va: 3.8649 3.9717 3.9509 3.8685 4.0108 3.9432 1.0039 1.0011 1.0039 1.0285 3.8119 1.0071 1.0073 2.3445 3.6622 3.8672 1.0202 1.0152 1.1200 3.9239 1.0032 1.0047 1.0084 3.9073 1.0088 1.0064 0.9986
dispcorr: -0.009703099 hartree
energy: -503.186173168330
dipole: 10.94080 -13.11790 -2.17710 -4.00711 3.40255 -0.60456 -0.33741 -0.06745 -0.40486
magnitude: 2.29547 au
magnitude: 5.83462 debye
temp: 298.15 k
press: 1.00 atm
zeropoint: 0.23312748 hartree
thermalvibcorrection: 0.01063200 hartree
thermalrotcorrection: 0.00141627 hartree
thermaltrasncorrection: 0.00141627 hartree
thermaltotal: -502.93958115 hartree
thermalcorr: 0.01346454 hartree
nonthermalcorr: 0.23312748 hartree
totalcorr: 0.24659202 hartree
thermalcorrenthalpy: 0.00094421 hartree
totalenthalpy: -502.93863694 hartree
