program: Gaussian 16
title: Title Card Required
version: ES64L-G16RevC.01
method: RmPW1PW91
basis: 6-31+G(d,p)
operation: Freq
keyword: #N
keyword: Geom=AllCheck
keyword: Guess=TCheck
keyword: SCRF=Check
keyword: GenChk
keyword: RmPW1PW91/6-31+G(d,p)
keyword: Freq
keywords: Freq
hfenergy: -781.5905447 hartree
pointgroup: C01 [X(C20H33)]
dipole: -1.9213833 0.7069153 2.2553781 debye
polarizability: 245.5123484|18.9360056|224.702402|-30.0005989|15.7086238|218.5058839 unknown
InChI: InChI=1S/C20H33/c1-14(2)18-12-10-17(5)19-11-9-15(3)7-6-8-16(4)13-20(18)19/h7,13,17-20H,6,8-12H2,1-5H3
charge 1 multiplicity 1
53 atoms
C  0.53924851 -3.32842194 -0.18105471
C  2.03878197 -3.56324912 -0.37986097
C  2.77376369 -2.21808673 -0.51926236
C  2.56181497 -1.26892614 0.71732
C  0.94938647 -1.09413472 0.95261147
C  0.2573713 -2.4615941 1.03765304
H  3.84649638 -2.42576295 -0.4398955
H  2.16825784 -4.08000883 -1.33893611
H  0.10999666 -2.85478648 -1.07109984
H  0.02155825 -4.28521392 -0.06504614
H  2.95058937 -1.79165651 1.59572712
H  0.60748088 -0.53357416 0.07532152
H  0.57328621 -2.99087013 1.94078904
H  -0.82037217 -2.29501397 1.13515139
C  2.64058213 -4.47120932 0.69414161
H  2.12703561 -5.43603454 0.71561076
H  3.69690634 -4.66670331 0.49045768
C  0.85687574 -0.27138656 2.14353887
C  0.78674261 -0.86626053 3.4885117
H  1.29153453 -1.8305926 3.56411282
H  1.12873273 -0.18269878 4.26619756
H  -0.28007986 -1.06902707 3.68272147
C  0.98681086 1.16917911 2.03213816
H  0.52437969 1.59319789 1.13980223
H  0.73218884 1.7198718 2.93698964
H  2.09361357 1.27295068 1.85944134
H  2.57714966 -4.05116887 1.70274246
C  3.27839553 0.0156117 0.49428631
H  2.84516941 0.64871723 -0.27722485
C  2.52852756 -1.57344162 -1.90635143
H  1.69644688 -2.08108782 -2.4060208
C  4.49970887 0.38525521 0.93877925
C  5.31370075 -0.36397326 1.94723982
H  4.78782411 -1.20143483 2.40760219
H  6.22362118 -0.75848756 1.48129936
H  5.64658733 0.31118219 2.74226748
C  5.18686852 1.53326245 0.24118403
H  5.89500638 2.03343912 0.90864045
H  4.44553266 2.27923576 -0.06431158
C  5.00016111 -1.00838686 -2.22214309
C  6.13465102 -1.95192222 -1.9403684
H  6.48548213 -2.39115231 -2.88129263
H  6.99190267 -1.4720101 -1.46785083
C  5.00780167 0.30058972 -1.93136825
H  4.14825655 0.88487051 -2.2659672
H  5.82367616 -2.79534863 -1.31252257
C  5.943709 1.04934816 -1.03481179
H  6.79946765 0.43654737 -0.74264906
H  6.34858066 1.93854167 -1.52997087
C  3.75810268 -1.63143953 -2.83964328
H  3.50036234 -1.13166798 -3.77956493
H  3.96207947 -2.67606714 -3.09908349
H  2.21725969 -0.5289569 -1.81624141
