program: Gaussian 16
title: Title Card Required
version: ES64L-G16RevC.01
method: RmPW1PW91
basis: 6-31+G(d,p)
operation: Freq
keyword: #N
keyword: Geom=AllCheck
keyword: Guess=TCheck
keyword: SCRF=Check
keyword: GenChk
keyword: RmPW1PW91/6-31+G(d,p)
keyword: Freq
keywords: Freq
hfenergy: -781.55215 hartree
pointgroup: C01 [X(C20H33)]
dipole: -0.1224559 0.4376915 1.5324911 debye
polarizability: 250.3947713|12.0835923|228.6665342|1.5462412|25.2725861|207.7717199 unknown
InChI: InChI=1S/C20H33/c1-15(2)8-7-13-20(5)18-12-11-16(3)9-6-10-17(4)14-19(18)21-20/h8-9,14,18-19H,6-7,10-13H2,1-5H3
charge 1 multiplicity 1
53 atoms
C  1.96021846 0.97768832 0.54093543
C  0.84781149 1.10515401 1.55558877
C  -0.50390124 1.58356335 1.12428214
C  -0.6776804 0.06248812 1.26401611
C  4.15799146 0.01613352 -0.16948407
C  3.10869785 0.02666754 0.9036201
H  -1.01838898 2.11141013 1.92746291
H  1.55443414 0.70181087 -0.43451916
H  2.34238027 2.0014965 0.42204398
H  -1.18278926 -0.21334314 2.18866017
H  4.67649307 0.96462381 -0.30648416
H  2.70919164 -0.97920823 1.0724887
H  3.56904605 0.34495389 1.8461348
C  1.20541131 1.31101805 3.00480293
H  1.6305984 2.31823558 3.07960268
H  0.32645659 1.27933046 3.65094502
C  4.53052934 -1.01152734 -0.94799121
C  3.947062 -2.39427753 -0.89294992
H  3.57351628 -2.68796822 -1.879693
H  4.72228956 -3.12122211 -0.62810618
H  3.13067674 -2.50458128 -0.17812956
C  5.62495562 -0.83933621 -1.96315082
H  6.02311554 0.17679754 -1.97078357
H  6.45185473 -1.52820795 -1.75968127
H  5.26314963 -1.07477169 -2.96984423
H  1.94941643 0.60261348 3.36779089
C  -0.96007704 -0.73415576 0.06102974
H  -0.55057205 -0.34908315 -0.86441673
C  -0.71568378 2.28507889 -0.21339409
H  -0.17346103 3.23633741 -0.16573268
C  -1.89970781 -1.69749959 -0.02452752
C  -2.57525619 -2.37591158 1.12451409
H  -2.19591865 -2.08333371 2.10460571
H  -3.65502513 -2.19574244 1.10610616
H  -2.44294608 -3.45877343 1.03134863
C  -2.45781929 -1.95779708 -1.39611325
H  -2.90998545 -2.95097302 -1.46486629
H  -1.6631163 -1.90408906 -2.14657611
C  -3.07008462 1.35379284 -0.62395751
C  -3.95738295 1.15349748 0.57148955
H  -4.63930175 2.00494339 0.6734587
H  -4.5665782 0.25216205 0.51569451
C  -2.98970374 0.50642268 -1.66288316
H  -2.33863939 0.79180949 -2.49112094
H  -3.3828568 1.11422807 1.50547687
C  -3.54512198 -0.88199489 -1.74321655
H  -4.40277584 -1.01452983 -1.0795077
H  -3.89947629 -1.09813722 -2.75540206
C  -2.18727829 2.58599154 -0.56953979
H  -2.18163121 3.09285703 -1.53935617
H  -2.59205334 3.30600535 0.15014364
H  -0.26418187 1.71997061 -1.03120807
H  0.46441434 -0.24342354 1.60816255
