program: Orca
programVersion: 4.2.1
elementType: C C C N H H N C N H H
charge: 1
multiplicity: 1
keywords: RKS B3LYP D3BJ def2-TZVPP Opt Freq
keywords: def2/J RIJCOSX TightSCF grid5 NoFinalGrid
keywords: PAL8
frequency: 0.00 0.00 0.00 0.00 0.00 0.00 164.94 186.49 468.64 470.46 514.54 535.10 602.31 622.80 650.91 814.34 892.19 915.50 923.06 1012.06 1118.80 1174.25 1271.05 1328.56 1358.43 1429.98 1462.63 1542.44 2247.01 3249.84 3256.85 3380.04 3611.66
frequency: 164.94 186.49 468.64 470.46 514.54 535.10 602.31 622.80 650.91 814.34 892.19 915.50 923.06 1012.06 1118.80 1174.25 1271.05 1328.56 1358.43 1429.98 1462.63 1542.44 2247.01 3249.84 3256.85 3380.04 3611.66
formula: C4H4N3
InChI: InChI=1S/C4H4N3/c1-5-4-2-6-3-7-4/h1-3,7H
11 atoms
C  0.29171 0.0454 -0.000011
C  -0.550692 1.153751 0.000058
C  -1.7925 -0.594061 0.000079
N  -0.528032 -1.068991 0.000017
H  -0.245201 -2.037713 0.000069
H  -2.65347 -1.242753 0.000098
N  -1.825848 0.730015 0.000039
C  2.778734 -0.010044 -0.000126
N  1.631829 -0.018848 -0.000112
H  3.851689 -0.001829 0.0002
H  -0.271636 2.194906 0.000046
totalener: -318.70044322 hartree
nucrepener: 266.32258760 hartree
electener: -585.02303082 hartree
oneelecener: -947.59698229 hartree
twoeener: 362.57395147 hartree
kineticenergy: 317.26290662 hartree
exchangeener: -33.184273411537 hartree
correlationener: -1.946165300908 hartree
xcener: -35.130438712446 hartree
energy: -398.6132 -396.5878 -394.1767 -285.7690 -284.5997 -283.6686 -282.9676 -34.0176 -32.9378 -29.2618 -27.4421 -24.0258 -22.2616 -22.1336 -21.6465 -18.9158 -18.7076 -18.3965 -16.8891 -16.7933 -16.4763 -13.1765 -12.3945 -11.9211 -7.1982 -7.0876 -4.1428 -3.8227 -3.5185 -3.0982 -2.6316 -1.7674 -1.2888 -1.0698 -0.5200 -0.0643 0.1114 0.4673 1.2553 1.6822 1.7377 2.2001 2.6518 2.8875 3.7025 3.9817 4.4194 4.7961 5.1406 5.9442 6.5729 6.8965 6.9399 7.5115 7.6878 8.2229 8.6233 8.6250 8.8428 9.3027 9.4603 10.0099 10.6796 10.8138 11.0394 11.3463 12.1850 12.2432 13.4312 13.6349 14.3202 14.9293 14.9624 15.0047 15.4555 16.3848 16.6157 16.7235 19.8535 20.0534 20.8953 21.2597 22.0396 22.0416 22.1295 23.3539 23.4709 24.6999 24.8593 25.7041 26.5727 28.3148 28.5312 28.7292 29.2598 29.2659 29.6872 29.8215 31.5423 32.0849 32.6838 32.8838 33.0751 33.7233 34.4352 35.2121 35.4481 35.9935 36.2675 36.3497 37.4653 37.6360 38.9368 39.7524 39.8022 41.0841 41.1518 41.5301 42.4631 43.1816 45.2583 45.6454 47.0349 47.1506 47.8840 48.9540 51.4315 52.1750 53.7796 54.2058 55.3676 56.0908 56.5151 56.9176 58.1611 58.1776 58.8509 60.1306 62.9852 64.3122 65.1966 65.2057 65.3023 66.7312 67.2867 67.4939 67.9785 68.7600 69.4795 69.9498 70.4723 70.5958 71.1226 72.3497 72.5203 73.2331 73.4646 73.8927 74.7853 75.7539 76.1350 76.8741 77.0209 77.3339 77.4414 78.4911 79.1229 79.3205 81.2375 81.3423 81.5816 82.5628 82.9126 84.0618 84.2603 85.3232 85.4805 85.7672 86.5003 88.2972 88.6461 90.9404 90.9604 91.4083 91.8898 92.2205 92.6756 93.1159 93.9014 94.6530 94.9322 95.6210 96.4095 96.6630 96.9881 97.2411 99.0289 99.6806 100.0124 100.7863 101.6005 101.7329 102.0455 102.3253 103.4336 105.8560 106.7682 107.9193 107.9699 108.1367 108.7718 110.7484 111.2606 112.2512 113.6698 115.1124 115.3464 117.2783 117.3248 117.7142 119.1443 119.6924 119.8012 120.3438 122.3165 123.0819 124.0241 124.3294 124.6820 124.7177 128.2255 129.2621 129.3517 129.8761 130.2436 131.4288 131.4721 133.5086 134.0040 134.0383 134.4043 135.4871 137.8424 138.3772 139.4451 141.6651 143.0458 143.7957 144.1172 144.6391 145.1296 146.4518 148.2712 149.0020 150.4485 151.0633 153.9373 157.9561 159.4577 160.2295 161.7758 168.0640 172.6151 180.5632 183.0758 185.6951 621.9770 629.3792 633.0462 635.5182 873.2864 886.9141 909.6441 electronvolt
chargesum: 1.0000000
charge: 0.177949 -0.032181 0.126256 -0.138983 0.206187 0.210776 -0.214296 -0.043121 0.201387 0.303536 0.202491
charge: -0.238704 -0.037211 -0.075405 0.404536 0.013802 0.031978 0.188262 0.245545 0.387881 0.046400 0.032916
qa: 0.1779 -0.0322 0.1263 -0.1390 0.2062 0.2108 -0.2143 -0.0431 0.2014 0.3035 0.2025
va: 3.8528 4.0342 3.9256 3.4419 0.9997 0.9726 3.1212 3.8598 3.8850 0.9146 0.9793
dispcorr: -0.016019299 hartree
energy: -318.716533754688
dipole: 0.66300 2.08226 2.74526 -1.06375 -0.03052 -1.09428 0.00040 -0.00026 0.00014
magnitude: 2.95531 au
magnitude: 7.51181 debye
temp: 298.15 k
press: 1.00 atm
zeropoint: 0.08020268 hartree
thermalvibcorrection: 0.00290419 hartree
thermalrotcorrection: 0.00141627 hartree
thermaltrasncorrection: 0.00141627 hartree
thermaltotal: -318.63059434 hartree
thermalcorr: 0.00573673 hartree
nonthermalcorr: 0.08020268 hartree
totalcorr: 0.08593941 hartree
thermalcorrenthalpy: 0.00094421 hartree
totalenthalpy: -318.62965013 hartree
