program: Gaussian 09
title: 000002584
version: EM64L-G09RevD.01
frameworkgroup: C1[X(C12H14N6O10S2)]
method: RPBEPBE
basis: SDD
operation: Freq
keyword: #p
keyword: freq=noraman
keyword: PBEPBE/SDD
title: #p freq=noraman PBEPBE/SDD
converged: YES YES NO NO
title: Mulliken charges:
elementType: S S O O O O O O O O O O N N N N N N C C C C C C C C C C C C H H H H H H H H H H H H H H
charge: 1.204959 0.238484 -0.292975 -0.215559 -0.544899 -0.464119 -0.450106 -0.290286 -0.298946 -0.324460 -0.401264 -0.252777 -0.536349 -0.386142 0.068106 -0.607615 -0.022546 -0.565276 0.000928 -0.280255 0.266407 -0.322947 0.237997 -0.100666 0.328014 0.345036 -0.675329 -0.207193 -0.298567 0.223254 0.300713 0.312794 0.283544 0.253926 0.421977 0.407610 0.350624 0.345987 0.325873 0.293101 0.261960 0.332160 0.339579 0.395243
chargesum: 0.00000
title: Mulliken charges with hydrogens summed into heavy atoms:
elementType: S S O O O O O O O O O O N N N N N N C C C C C C C C C C C C
charge: 1.204959 0.238484 -0.292975 -0.215559 -0.137289 -0.464119 -0.450106 -0.290286 -0.298946 -0.324460 -0.006021 -0.252777 -0.536349 0.035835 0.068106 0.088996 -0.022546 0.106463 0.301642 0.032539 0.266407 0.214523 0.237997 -0.100666 0.328014 0.345036 -0.349457 -0.207193 0.256494 0.223254
polarizability: 3.85550427e+02 -2.33257249e+01 2.57213771e+02 1.12141920e+01 -5.69352650e+00 1.65222879e+02
1716.lowfreq: -6.3916 -2.6836 -0.0013 -0.0008 -0.0006 4.4621 8.0673 18.9146 24.7744
frequency: 7.7047 18.7576 24.7064 26.6237 33.6307 39.9537 41.9586 49.4253 53.2901 62.8545 78.5638 84.6498 96.4975 100.7160 113.8657 118.9765 126.7578 157.1819 165.5277 173.9316 194.0458 226.1955 234.5217 239.5669 246.4685 268.2252 276.3627 285.8468 294.6746 298.6494 307.6616 312.0350 319.0481 359.9890 368.6565 386.5005 398.7383 419.1667 434.6440 449.3212 466.5294 479.0006 491.6525 498.3082 509.3412 535.0724 540.3825 551.4297 563.4041 572.6990 585.7801 588.0870 604.9229 624.6939 635.4658 642.8339 656.2529 674.1448 698.9884 743.5342 747.4202 760.0611 787.3243 798.7745 804.6550 812.7467 832.2853 848.7411 869.5413 883.9029 918.8962 945.8216 970.4578 979.9816 998.0324 999.2532 1011.7133 1027.6351 1045.1611 1065.8943 1084.4927 1092.0386 1097.6666 1127.6542 1146.2391 1183.7285 1185.7210 1202.9832 1217.1948 1230.7061 1243.4055 1262.9291 1275.9650 1277.6930 1300.2916 1313.7576 1334.7883 1338.7348 1373.5193 1375.6909 1429.3217 1443.5434 1473.7836 1486.0351 1492.9930 1570.8289 1589.0338 1592.1548 1639.5849 1663.4461 1677.2357 1688.6601 3005.4138 3025.1363 3027.5106 3048.4872 3067.6561 3096.8684 3102.0463 3269.2532 3312.9218 3521.6593 3553.8304 3557.2446 3708.2457 3708.5495
redmass: 6.7087 9.3313 10.2444 10.8090 8.6357 6.8176 7.8408 8.8725 7.1819 8.5313 8.9449 10.3392 8.7278 8.2882 7.0780 11.4048 5.6134 6.3983 8.4516 4.3784 9.1566 9.8742 7.7402 6.5019 7.9486 6.8099 7.2898 4.8084 4.4646 2.4141 4.0912 2.1865 10.2999 8.6901 5.5025 6.8457 9.4364 10.2494 1.5551 3.2091 5.5204 3.8368 3.6409 1.9797 1.0960 1.1862 5.8661 8.8139 6.0205 5.0326 3.0513 1.8357 3.3503 5.4748 3.7940 1.6369 7.1357 6.8045 10.8888 7.3262 6.3014 3.4053 3.3940 2.1138 3.2703 4.5502 1.8075 2.8643 12.3260 4.9201 5.4560 3.9712 3.2913 2.9189 8.6305 2.2563 5.8844 5.5063 2.3405 1.9964 2.4881 3.2393 1.5079 2.5026 2.7214 1.6860 1.1089 2.1670 1.5799 2.3582 1.4942 3.6107 1.3139 1.3439 2.0715 1.4395 1.5906 7.2987 2.1130 1.5808 1.1680 5.8832 2.0045 1.6516 2.2234 6.6030 1.5467 1.2146 2.9666 8.5522 10.6437 7.2391 1.0741 1.0560 1.0580 1.0839 1.0888 1.1060 1.1070 1.0956 1.0828 1.0642 1.0449 1.0453 1.1046 1.1059
irintensity: 0.0472 1.4749 0.7798 0.3984 7.9710 0.1747 0.2803 0.2105 0.6541 1.0669 2.1897 0.9421 3.9063 6.8127 2.3458 0.7059 5.6248 1.1468 10.6473 12.9479 5.7012 6.6394 3.0275 5.6811 3.3566 2.1437 0.9256 7.2153 13.5902 30.9551 15.4065 25.4013 24.8834 42.0984 3.1109 18.8964 22.3957 83.9362 258.4562 8.2062 36.8696 9.7689 11.4400 13.2214 109.0761 252.0915 14.7695 49.3547 14.7774 13.0639 24.3624 162.5757 10.1675 38.9824 32.2724 138.1788 1.0833 38.0767 51.1221 42.0859 38.4778 13.7508 32.0712 26.8921 47.7057 15.3389 83.2531 62.5207 124.2829 6.3579 11.5583 5.2391 66.3967 6.5551 112.4032 35.9621 69.0428 369.5221 95.7944 4.0754 145.4798 194.9660 14.1867 53.9291 2.7826 43.1318 5.7443 69.3089 9.0800 12.2659 25.0264 73.0600 69.8130 126.6990 189.5053 5.6646 50.5250 25.5712 82.7604 50.2006 3.7649 12.9977 430.0101 2.1186 91.6488 108.7106 26.1160 82.8446 559.1394 297.2209 286.0488 334.1094 235.3077 47.8346 22.0636 46.3181 8.0206 3.3050 2.0457 24.6230 247.9660 53.6757 64.7023 137.1561 49.7716 50.8624
temp: 298.150 k
press: 1.00000 atm
elementType: 16 16 8 8 8 8 8 8 8 8 8 8 7 7 7 7 7 7 6 6 6 6 6 6 6 6 6 6 6 6 1 1 1 1 1 1 1 1 1 1 1 1 1 1
symmnumber: 1
zpe: 760127.3 jmol-1
zpe.correction: 0.289517 hartree
zpe.thermalcorrener: 0.321099 hartree
zpe.thermalcorrenthalpy: 0.322044 hartree
zpe.thermalcorrgfe: 0.221449 hartree
zpe.sumelectzpe: -2340.065419 hartree
zpe.sumelectthermal: -2340.033837 hartree
zpe.sumelectthermalent: -2340.032892 hartree
zpe.sumelectthermalfe: -2340.133487 hartree
dipole: 9.6943 2.3534 3.0816
dipole: 10.4410
quadrupole: -182.3643 -179.9492 -188.7616
quadrupole: -3.4738 7.7505 -6.4959
quadrupole: 1.3274 3.7425 -5.0699 -3.4738 7.7505 -6.4959
hfenergy: -2340.3549361 hartree
pointgroup: C01 [X(C12H14N6O10S2)]
dipole: -3.8559207 -0.5339802 -1.3117981 debye
polarizability: 382.601901|27.3197363|206.3833222|-17.0239359|-47.4273979|219.0018538 unknown
InChI: InChI=1S/C12H14N6O10S2/c13-11-15-4(3-29-11)7(17-28-2-6(19)20)9(21)16-8-5(1-27-12(14)23)18(10(8)22)30(24,25)26/h3,5,8,16,19,24H,1-2,13-14H2
charge 0 multiplicity 1
44 atoms
S  5.250846 -0.570945 0.555195
S  -5.668723 -1.352173 2.1096
O  0.721823 -2.324605 -1.046372
O  3.053654 1.452447 2.226624
O  5.526738 1.172861 0.951376
O  5.472517 -0.792611 -1.015204
O  5.976015 -1.535307 1.611045
O  -1.157244 -1.115455 2.312419
O  -0.309375 -0.701845 -2.425462
O  -0.91084 1.767111 -0.603417
O  0.908206 3.092403 -3.409979
O  1.585388 1.922868 -1.517267
N  3.421903 -0.533678 0.900774
N  0.239462 0.157379 0.975246
N  -2.234315 1.213787 -0.359775
N  -1.434331 -2.623021 -1.687529
N  -4.669209 0.243674 0.187267
N  -7.041569 -0.021573 0.039895
C  2.274471 -1.449341 0.572345
C  1.410336 -0.477181 1.514273
C  2.695641 0.391367 1.668365
C  1.92773 -1.476747 -0.919875
C  -1.022115 -0.246902 1.391684
C  -2.228715 0.330543 0.64655
C  -0.354668 -1.783389 -1.786524
C  -3.578003 -0.178679 0.983721
C  -3.903019 -1.026122 2.041092
C  -5.813419 -0.251388 0.610492
C  -0.815654 2.300695 -1.960987
C  0.676465 2.398979 -2.231026
H  2.398203 -2.46569 0.980421
H  1.14584 -0.986545 2.457764
H  1.732483 -0.467886 -1.320815
H  2.738759 -1.950327 -1.499518
H  0.306284 0.882376 0.240213
H  4.772231 1.49563 1.568874
H  -2.300602 -2.363361 -2.151837
H  -1.388346 -3.455634 -1.104392
H  -3.227504 -1.468289 2.766212
H  -1.267474 1.594241 -2.678199
H  -1.304582 3.287571 -2.034074
H  -7.895804 -0.411328 0.425692
H  -7.087864 0.606532 -0.75968
H  1.88408 3.119256 -3.605709
