program: Gaussian 16
title: Title
version: ES64L-G16RevC.01
method: RB3LYP
basis: GenECP
operation: Freq
keyword: #N
keyword: Geom=AllCheck
keyword: Guess=TCheck
keyword: SCRF=Check
keyword: GenChk
keyword: RB3LYP/GenECP
keyword: Freq
hfenergy: -4110.2334575 hartree
pointgroup: C01 [X(C62H50N4O17Rh2)]
dipole: 0.1126947 1.9478876 8.0800875 debye
polarizability: 1024.0344097|62.7787375|994.360951|-49.017588|77.4386404|1260.7680313 unknown
InChI: InChI=1S/C18H18O.4C11H8NO4.2Rh/c1-3-9-15(2)19-18-13-8-7-12-17(18)14-16-10-5-4-6-11-16;4*1-6(11(15)16)12-9(13)7-4-2-3-5-8(7)10(12)14;;/h3-8,10-14H,1,9H2,2H3;4*2-6H,1H3;;/q;4*-2;2*+4
charge 0 multiplicity 1
135 atoms
C  -0.4855331 -0.31879621 1.50109914
C  0.7923432 0.24648693 1.92696821
C  1.81040887 -0.52025432 2.52641041
C  1.01281426 1.6356444 1.78238312
C  2.98844585 0.08012677 2.97164686
H  1.67551658 -1.58855191 2.65334118
C  2.1818215 2.23044104 2.23783344
H  0.25538929 2.23892327 1.29087598
C  3.18006701 1.45508374 2.84159551
H  3.75851604 -0.5368309 3.42502511
H  2.32122679 3.30041817 2.10923576
H  4.09984543 1.91548762 3.18455993
Rh -0.27613944 -0.43219559 -0.86223144
Rh -0.33151763 -0.61402037 -3.31744103
O  -1.78396108 -1.85673737 -0.85618242
O  -1.73083653 1.01081412 -1.00688077
O  1.30286109 -1.80588848 -0.91543692
O  1.13807464 1.06668275 -1.10554059
O  -1.81451252 -2.07151831 -3.11333286
O  1.22152158 -1.99001228 -3.17535813
O  1.07396333 0.89769866 -3.37019259
O  -1.82261381 0.84443933 -3.27047514
C  -2.28135699 -2.25424713 -1.95277752
C  -2.12787045 1.36510876 -2.16330833
C  1.72338011 -2.22473083 -2.03493964
C  1.49058731 1.38893787 -2.28013104
C  -3.60081205 -3.03879944 -1.8121156
C  -3.06683875 2.57988365 -2.1568557
C  3.01425282 -3.06490449 -2.04726172
C  2.49739885 2.5404321 -2.38497209
C  -3.36234008 3.1525335 -3.53850609
H  -4.0469825 4.0006252 -3.44533202
H  -2.44307922 3.48484296 -4.02478103
H  -3.83100827 2.38751649 -4.16200476
C  2.94543025 -4.25441047 -3.0084299
H  3.90967359 -4.77066025 -3.02055069
H  2.17057438 -4.95846207 -2.6981734
H  2.7211462 -3.89837297 -4.01558659
C  -4.35144394 -3.22286647 -3.12797388
H  -4.61281826 -2.25401736 -3.55862534
H  -3.72625239 -3.7646598 -3.84151249
H  -5.26588334 -3.79649307 -2.95119844
C  3.1325038 2.68068838 -3.7676469
H  3.81287145 3.53752681 -3.77039315
H  3.6920484 1.77907096 -4.02899515
H  2.35829654 2.84145963 -4.52062708
H  1.93344994 3.44430781 -2.14033143
H  3.79954767 -2.37361271 -2.36993219
H  -3.35514649 -4.01339854 -1.37712053
N  3.50287478 2.39697091 -1.34443716
C  4.19577638 1.19903409 -1.11022081
C  3.90059042 3.41735132 -0.4807349
O  4.02055605 0.17605376 -1.74556463
C  5.13397924 1.48791624 0.01059373
O  3.43825481 4.54703543 -0.45879226
C  4.97297984 2.83000155 0.36997553
C  6.04067646 0.66643902 0.66246513
C  5.72261648 3.40676967 1.38210112
C  6.79853332 1.24009795 1.69430092
H  6.1448968 -0.37663159 0.38406396
C  6.64815852 2.58749733 2.04492037
H  5.59096217 4.44910836 1.65332044
H  7.51892141 0.6292384 2.22994887
H  7.25464685 3.00220935 2.84414359
N  3.38978999 -3.45241403 -0.69577427
C  2.58525213 -4.21615387 0.1592069
C  4.49058631 -2.90062352 -0.02043373
O  1.59637925 -4.8428614 -0.17949551
C  3.18990968 -4.08549269 1.51603513
O  5.38282583 -2.26061607 -0.54491152
C  4.33239005 -3.28856262 1.40688643
C  2.76924688 -4.5815816 2.74095611
C  5.10035859 -2.96079837 2.5133251
C  3.52922044 -4.24277658 3.86948879
H  1.87793302 -5.19271904 2.82525275
C  4.67660513 -3.44715385 3.75805556
H  5.9848318 -2.33958789 2.41922712
H  3.22412094 -4.60311793 4.84682801
H  5.24397596 -3.20235126 4.65044288
H  -3.99029632 2.24849093 -1.67612505
N  -4.40613897 -2.36459866 -0.79739562
C  -4.64006398 -0.98304819 -0.80376344
C  -4.78934466 -2.95448671 0.41761287
O  -4.41254425 -0.24679705 -1.74791164
C  -5.20795038 -0.65327774 0.52931964
O  -4.67046887 -4.13412406 0.68993828
C  -5.33647822 -1.84433025 1.25006404
C  -5.56718046 0.57176077 1.07111911
C  -5.85915145 -1.85791422 2.53348575
C  -6.0812047 0.56714278 2.37591664
H  -5.4325359 1.49756586 0.5216584
C  -6.23188953 -0.62697036 3.09182074
H  -5.96761372 -2.78548196 3.08565508
H  -6.36868784 1.50614434 2.83892119
H  -6.63937282 -0.59763323 4.09757955
N  -2.4822207 3.56948972 -1.25452768
C  -1.14164249 3.97674984 -1.35324377
C  -3.04246163 3.93112807 -0.02351576
O  -0.4133375 3.72538598 -2.2972396
C  -0.84322924 4.72687438 -0.10698403
O  -4.14625428 3.59689357 0.37450423
C  -2.00559762 4.74440215 0.67217447
C  0.33209632 5.32708144 0.31839556
C  -2.04776719 5.4012334 1.8908681
C  0.3015406 5.9767924 1.5621396
H  1.24255813 5.27714041 -0.26906563
C  -0.86952533 6.02539188 2.32720116
H  -2.94878494 5.41203416 2.49235059
H  1.20288907 6.4527505 1.93549474
H  -0.86200012 6.5419869 3.2817919
C  -0.9313288 -1.67921889 1.89031036
C  -0.28305352 -2.86663559 1.53680008
C  -2.09531413 -1.83605379 2.66234943
C  -0.77342108 -4.11426968 1.93095284
H  0.57932708 -2.8052785 0.89287341
C  -2.60469083 -3.04972887 3.08287079
O  -2.77777729 -0.64864998 2.97267894
C  -1.93045991 -4.21391644 2.70149686
H  -0.2513836 -5.00496962 1.59835391
H  -3.50096544 -3.07914072 3.69037202
C  -2.01386776 0.34670784 3.39568535
H  -2.31769559 -5.18225034 3.00076998
C  -0.97948233 0.13380657 4.43864951
C  -2.65121419 1.69283626 3.21795854
H  -0.64180538 -0.90052509 4.48553336
H  -0.12248883 0.79235201 4.27566914
H  -2.89010009 1.8413623 2.15751952
H  -3.62565301 1.63204338 3.72749462
H  -1.2619707 0.40236371 1.25778204
C  -1.83934264 2.82820809 3.77743666
H  -0.90402758 3.04881374 3.26986364
C  -2.20745511 3.54439762 4.8389864
H  -3.13743189 3.348148 5.36825593
H  -1.59626081 4.36220535 5.20962056
H  -1.42446007 0.4210789 5.40334401
