program: Gaussian 16
title: Rh SPTAD TSS N2 extrusion
version: ES64L-G16RevC.01
method: RB3LYP
basis: GenECP
operation: Freq
keyword: #N
keyword: Geom=AllCheck
keyword: Guess=TCheck
keyword: SCRF=Check
keyword: GenChk
keyword: RB3LYP/GenECP
keyword: Freq
hfenergy: -4219.7381222 hartree
pointgroup: C01 [X(C62H50N6O17Rh2)]
dipole: 0.3521901 1.6098358 5.4400042 debye
polarizability: 1039.9011265|13.229101|987.9564822|-11.1407668|89.8422091|1060.428524 unknown
InChI: InChI=1S/C18H18N2O.4C11H8NO4.2Rh/c1-3-9-14(2)21-17-13-8-7-12-16(17)18(20-19)15-10-5-4-6-11-15;4*1-6(11(15)16)12-9(13)7-4-2-3-5-8(7)10(12)14;;/h3-8,10-14H,1,9H2,2H3;4*2-6H,1H3;;/q;4*-2;2*+4
charge 0 multiplicity 1
137 atoms
Rh -0.08134533 -0.55696674 -0.70887584
Rh -0.2170132 -1.13043664 -3.10992631
O  1.63876362 -1.67172428 -0.65850383
O  1.59225218 -2.13816396 -2.87890572
O  -1.21574725 -2.24728634 -0.39305489
O  -1.21279502 -2.87348596 -2.57203719
O  -1.86664585 0.48293265 -0.98117641
O  -2.02038147 -0.13298288 -3.16187699
O  1.02624688 1.1057203 -1.28054321
O  0.78254331 0.63689323 -3.49027151
C  2.09136987 -2.20247736 -1.72260024
C  -2.44678118 0.42381519 -2.10826589
C  1.23282421 1.3052787 -2.52068648
C  -1.53851841 -3.00650326 -1.36303884
C  -2.41129852 -4.2028324 -0.95871069
C  -2.999585 -4.96898516 -2.13920817
C  2.12065132 2.51340109 -2.85005385
C  2.44519255 2.65250476 -4.33518841
C  -3.85363378 1.02461834 -2.18936182
C  -4.2926613 1.36377903 -3.61459687
C  3.41045011 -2.96821698 -1.55280319
N  -3.43564816 -3.71354513 -0.04305168
C  -4.28346211 -2.64056817 -0.34724278
C  -3.49853102 -4.06248741 1.31661266
O  -4.33931471 -2.0887466 -1.43366545
C  -5.02559359 -2.33617324 0.90387627
O  -2.80220103 -4.90252511 1.85449294
C  -4.55230977 -3.18936757 1.9068515
C  -6.01004251 -1.39216565 1.1525701
C  -5.04539155 -3.12794142 3.20065918
H  -6.34481554 -0.70945139 0.38023206
C  -6.51935954 -1.32903318 2.45841755
C  -6.04518822 -2.17996423 3.46430973
H  -4.67060007 -3.78707351 3.97658546
H  -7.28797685 -0.60020337 2.6955924
H  -6.45625219 -2.10149253 4.46577885
N  3.53503559 -3.37136276 -0.15914609
C  2.52893744 -4.08636799 0.51471397
C  4.41063911 -2.73902261 0.73691519
O  1.59464233 -4.65242636 -0.02376854
C  2.84517204 -3.96759636 1.96349567
O  5.32436123 -1.99972098 0.41661888
C  3.97551405 -3.15602648 2.09718009
C  2.19090689 -4.48913573 3.06953158
C  4.49400535 -2.83480472 3.34134661
H  1.31405419 -5.11761291 2.9577387
C  2.70330187 -4.16279365 4.33329884
C  3.83522408 -3.34932631 4.46651515
H  5.36594016 -2.1980758 3.43724603
H  2.21425095 -4.54530158 5.22366062
H  4.20534562 -3.11038522 5.45851445
N  3.32714631 2.43501515 -2.03552488
C  4.13007163 1.29070444 -1.92523956
C  3.80025677 3.48921336 -1.24417829
O  3.90877604 0.23121379 -2.48577797
C  5.23019239 1.65443719 -0.99395862
O  3.27624836 4.58603401 -1.15840922
C  5.0197209 2.96938725 -0.56524578
C  6.29514755 0.89778411 -0.53125204
C  5.86247178 3.57489151 0.35293021
H  6.42879034 -0.13131576 -0.84161453
C  7.15702067 1.50504292 0.39442662
C  6.94209066 2.81765051 0.83193493
H  5.68957471 4.59128632 0.69040337
H  7.99903691 0.94403121 0.7870486
H  7.6221748 3.25585243 1.55539569
N  -3.96974253 2.17201569 -1.30533074
C  -5.0199989 2.35212495 -0.39837279
C  -3.0831822 3.25698073 -1.31200282
O  -5.9286038 1.56222659 -0.20743976
C  -4.78247697 3.67767382 0.23675865
O  -2.09946799 3.34755942 -2.02515894
C  -3.60930903 4.21488615 -0.29987904
C  -5.51009504 4.3465768 1.20788126
C  -3.1166088 5.44034991 0.12010821
H  -6.42026976 3.92174995 1.6182821
C  -5.0159326 5.58324367 1.64600703
C  -3.83694674 6.11948277 1.11293684
H  -2.2065985 5.85339064 -0.30046026
H  -5.55437915 6.13505507 2.4100362
H  -3.47817471 7.07899813 1.47170587
H  -1.77834605 -4.86056603 -0.35334153
H  1.59158907 3.40313595 -2.4942341
H  -4.51464557 0.25791431 -1.77174772
C  3.57088839 -4.1345814 -2.52583012
H  4.20152645 -2.22877081 -1.71769645
C  0.09597782 -0.10022715 1.42681367
C  -1.04906014 0.7221281 1.9053056
C  1.42757266 0.09080291 2.10239514
C  -2.35572483 0.19810677 1.83707374
C  -0.89734556 2.04956553 2.37088211
C  1.48914586 0.09358157 3.50827965
C  2.6098733 0.25642319 1.37258628
C  -3.45868711 0.9147369 2.27569276
H  -2.49477628 -0.79971502 1.4370975
C  -2.02128653 2.77936385 2.77978953
C  2.69716775 0.26805968 4.1701981
H  0.57244566 -0.03032189 4.07820085
C  3.82027804 0.46004019 2.03975484
H  2.5788504 0.24066491 0.29353915
C  -3.29020436 2.2163098 2.7583625
H  -4.44391847 0.46755454 2.22949372
H  -1.86023248 3.79058938 3.13753138
C  3.86912748 0.46261118 3.43188242
H  2.72648869 0.26070115 5.2555863
H  4.72855403 0.59057394 1.46731886
H  -4.14291224 2.79060744 3.10263347
H  4.81730215 0.60800826 3.94145846
O  0.31956703 2.65113044 2.54082978
C  1.01842641 3.22426459 1.40304636
C  0.15730008 4.21413951 0.63700717
C  2.2826086 3.84436348 2.00856241
H  -0.19909814 5.01812168 1.28823682
H  -0.69914082 3.71439012 0.18098991
H  2.84297124 3.03616903 2.49449679
H  2.89630965 4.23299051 1.19244142
H  1.30703113 2.41447452 0.72734169
C  2.00063674 4.93970121 2.99788538
H  1.40070891 4.65753501 3.86200781
C  2.42850109 6.19755871 2.87418035
H  2.20527912 6.95713185 3.61932621
H  3.02301202 6.51309766 2.01847939
H  0.75738007 4.65579555 -0.16559595
H  4.54852775 -4.60222733 -2.3787596
H  2.79082329 -4.88155571 -2.36355767
H  3.50288406 -3.76997479 -3.55279255
H  1.5232047 2.75211708 -4.9125653
H  3.05872215 3.54447141 -4.49115128
H  2.98774204 1.77515535 -4.69474844
H  -3.63960149 -4.31959928 -2.73997996
H  -2.19481072 -5.34941864 -2.77243247
H  -3.58832265 -5.8133845 -1.76989183
H  -3.63634642 2.12120162 -4.05119341
H  -5.31726498 1.74663512 -3.59708468
H  -4.25944121 0.46922337 -4.23911086
N  -0.24795083 -1.66177199 2.03876501
N  -0.33101483 -2.76821693 2.10064249
